Ethanone, 2-iodo-1-(4-methoxyphenyl)-
- Formula: C9H9IO2
- Molecular weight: 276.0710
- IUPAC Standard InChIKey: WKOMPGVMEHWAQR-UHFFFAOYSA-N
- CAS Registry Number: 80336-72-7
- Chemical structure:
View 3d structure (requires JavaScript / HTML 5) - Permanent link for this species. Use this link for bookmarking this species for future reference.

Gas phase ion energetics data

Data compiled by: Sharon G. Lias, John E. Bartmess, Joel F. Liebman, John L. Holmes, Rhoda D. Levin, and W. Gary Mallard
Ionization energy determinations
IE (eV) | Method | Reference | Comment |
---|---|---|---|
8.2 | PE | Distefano, Granozzi, et al., 1987 | |
8.60 | PE | Distefano, Granozzi, et al., 1987 | Vertical value |

References

Distefano, Granozzi, et al., 1987
Distefano, G.; Granozzi, G.; Olivato, P.R.; Guerrero, S.A.,
Hyperconjugative interactions in halogen-substituted carbonyls: Ultraviolet photoelectron spectroscopy of w-halogenoacetophenones,
J. Chem. Soc. Perkin Trans. 2, 1987, 1459. [all data]