Dapsone
- Formula: C12H12N2O2S
- Molecular weight: 248.301
- IUPAC Standard InChIKey: MQJKPEGWNLWLTK-UHFFFAOYSA-N
- CAS Registry Number: 80-08-0
- Chemical structure:
View 3d structure (requires JavaScript / HTML 5) - Other names: Benzenamine, 4,4'-sulfonylbis-; Aniline, 4,4'-sulfonyldi-; p-Aminophenyl sulfone; p,p'-diaminodiphenyl sulfone; p,p'-sulfonyldianiline; Avlosulfon; Avlosulfone; Bis(p-aminophenyl) sulfone; Bis(4-aminophenyl) sulfone; Croysulfone; Dapson; Di(p-aminophenyl) sulfone; Di(4-aminophenyl) sulfone; Diaphenyl sulfone; Diphenasone; Diphone; Disulone; Dumitone; DADPS; DDS; DSS; Eporal; F 1358; Metabolite C; Novophone; Sulfadione; Sulfona; Sulfona-MAE; Udolac; 1,1'-Sulfonylbis[4-aminobenzene]; 1358F; 4,4'-Diaminodiphenyl Sulfone; 4,4'-Sulfonylbis[benzamine]; 4,4'-Sulfonyldianiline; 4-Aminophenyl sulfone; Diaminodiphenyl sulfone; Diaphenylsulfon; DDS, pharmaceutical; N,N'-Diphenyl sulfondiamide; NCI-C01718; NSC 6091D; WR 448; Avlosulphone; Bis(p-aminophenyl)sulphone; Bis(4-aminophenyl)sulphone; Croysulphone; Dapsonum; 4,4-Diaminodifenylsulfon; Diaminodifenilsulfona; Diamino-4,4'-diphenyl sulfone; Diamino-4,4'-diphenyl sulphone; p,p-Diaminodiphenyl sulphone; 4,4'-Diaminodiphenyl sulphone; Di(p-aminophenyl)sulphone; Di(4-aminophenyl)sulphone; Diaphenylsulphon; Diaphenylsulphone; Dubronax; ICI; NSC-6091; Sulfone UCB; 4,4'-Sulfonylbisaniline; p,p-Sulfonylbisbenzamine; p,p-Sulfonylbisbenzenamine; Sulphadione; Sulphon-Mere; 1,1'-Sulphonylbis(4-aminobenzene); p,p-Sulphonylbisbenzamine; 4,4'-Sulphonylbisbenzamine; p,p-Sulphonylbisbenzenamine; 4,4'-Sulphonylbisbenzenamine; Sulphonyldianiline; p,p-Sulphonyldianiline; 4,4'-Sulphonyldianiline; Tarimyl; 4,4'-Dapsone; 4,4'-DDS; 4,4'-Sulfonylbisbenzeneamine; Araldite HT 976; DDS, diaphenylsulfone; Dimitone; Sulfanona-mae; Sulfon-mere; Sulfonyldianiline; Sumicure S; Dianiline, 4,4'-sulfonyl-; 4,4'-Sulfonyldiphenylamine; Servidapson; HT 976; HT 9664

Condensed phase thermochemistry data

Data compiled by: Eugene S. Domalski and Elizabeth D. Hearing
Constant pressure heat capacity of solid
Cp,solid (J/mol*K) | Temperature (K) | Reference | Comment |
---|---|---|---|
314.9 | 298. | Lesbats and Lichanot, 1987 | T = 250 to 400 K. |

Phase change data

Data compiled as indicated in comments:
DH - Eugene S. Domalski and Elizabeth D. Hearing
TRC - Thermodynamics Research Center, NIST Boulder Laboratories, Chris Muzny director
Quantity | Value | Units | Method | Reference | Comment |
---|---|---|---|---|---|
Tfus | 451. | K | N/A | Lesbats and Lichanot, 1987 | DH |
Tfus | 451. | K | N/A | Grady, Hays, et al., 1973 | Uncertainty assigned by TRC = 1. K; TRC |

Gas phase ion energetics data

Data compiled by: Sharon G. Lias, Rhoda D. Levin, and Sherif A. Kafafi
Ionization energy determinations
IE (eV) | Method | Reference |
---|---|---|
7.25 ± 0.05 | PI | Evlasheva, Puchkova, et al., 1975 |
7.25 | PI | Pykhtina, Cherednichenko, et al., 1974 |

Normal alkane RI, non-polar column, custom temperature program

Column type | Active phase | I | Reference | Comment |
---|---|---|---|---|
Other | Methyl Silicone | 2880. | Ardrey and Moffat, 1981 | Program: not specified |

References

Lesbats and Lichanot, 1987
Lesbats, C.; Lichanot, A.,
Capacites calorifiques de durcisseurs amines et resines epoxydes,
Thermochim. Acta, 1987, 109, 317-329. [all data]
Grady, Hays, et al., 1973
Grady, L.T.; Hays, S.E.; King, R.H.; Klein, H.R.; Mader, W.J.; Wyatt, D.K.; Zimmere, R.O.,
Drug purity profiles,
J. Pharm. Sci., 1973, 62, 459. [all data]
Evlasheva, Puchkova, et al., 1975
Evlasheva, T.I.; Puchkova, V.V.; Potapov, V.K.; Gur'yanova, E.N.,
Ionisation potentials and electron-donating properties of sulphones,
Russ. J. Phys. Chem., 1975, 49, 453. [all data]
Pykhtina, Cherednichenko, et al., 1974
Pykhtina, E.V.; Cherednichenko, L.V.; Kardash, I.E.; Evlasheva, T.I.; Sorokin, V.V.; Potapov, V.K.; Pravednikov, A.N.,
Ionization potentials of amines and energies of charge transfer bands in the absorption spectra of complexes of 7,7,8,8-tetracyanoquinodimethan,
High Energy Chem., 1974, 8, 257, In original 307. [all data]
Ardrey and Moffat, 1981
Ardrey, R.E.; Moffat, A.C.,
Gas-liquid chromatographic retention indices of 1318 substances of toxicological interest on SE-30 or OV-1 stationary phase,
J. Chromatogr., 1981, 220, 3, 195-252, https://doi.org/10.1016/S0021-9673(00)81925-1
. [all data]