Benzene, 1,1'-sulfonylbis[4-chloro-
- Formula: C12H8Cl2O2S
- Molecular weight: 287.162
- IUPAC Standard InChIKey: GPAPPPVRLPGFEQ-UHFFFAOYSA-N
- CAS Registry Number: 80-07-9
- Chemical structure:
View 3d structure (requires JavaScript / HTML 5) - Other names: Sulfone, bis(p-chlorophenyl); p,p'-Dichlorodiphenyl sulfone; Bis(p-chlorophenyl) sulfone; Bis(4-chlorophenyl) sulfone; 4-Chloro-1-(4-chlorophenylsulfonyl)benzene; 4-Chlorophenyl sulfone; 4,4'-Dichlorodiphenyl sulfone; p-Chlorophenyl sulfone; 4,4'-Dichlorodiphenyl sulphone; Bis(4-chlorophenyl)sulphone; 1,1'-Sulfonylbis(4-chlorobenzene); Di-p-chlorophenyl sulfone; NSC 23899; 1-Chloro-4-[(4-chlorophenyl)sulfonyl]benzene; 85228-26-8

Condensed phase thermochemistry data

Data compiled by: Eugene S. Domalski and Elizabeth D. Hearing
Quantity | Value | Units | Method | Reference | Comment |
---|---|---|---|---|---|
S°solid,1 bar | 314.2 | J/mol*K | N/A | Novoselova, Tsvetkova, et al., 1985 |
Constant pressure heat capacity of solid
Cp,solid (J/mol*K) | Temperature (K) | Reference | Comment |
---|---|---|---|
269.3 | 298.15 | Novoselova, Tsvetkova, et al., 1985 | T = 14 to 480 K. |

Phase change data

Data compiled as indicated in comments:
TRC - Thermodynamics Research Center, NIST Boulder Laboratories, Chris Muzny director
AC - William E. Acree, Jr., James S. Chickos
DH - Eugene S. Domalski and Elizabeth D. Hearing
Quantity | Value | Units | Method | Reference | Comment |
---|---|---|---|---|---|
Tfus | 421.9 | K | N/A | Olah and Gupta, 1983 | Uncertainty assigned by TRC = 3. K; TRC |
Quantity | Value | Units | Method | Reference | Comment |
Ttriple | 422. | K | N/A | Novoselova, Tsvetkova, et al., 1985, 2 | Uncertainty assigned by TRC = 2. K; TRC |
Enthalpy of vaporization
ΔvapH (kJ/mol) | Temperature (K) | Reference | Comment |
---|---|---|---|
59.7 | 478. | Dykyj, Svoboda, et al., 1999 | Based on data from 463. to 573. K.; AC |
Enthalpy of fusion
ΔfusH (kJ/mol) | Temperature (K) | Reference | Comment |
---|---|---|---|
24.400 | 422. | Novoselova, Tsvetkova, et al., 1985 | DH |
24.4 | 422. | Domalski and Hearing, 1996 | AC |
Entropy of fusion
ΔfusS (J/mol*K) | Temperature (K) | Reference | Comment |
---|---|---|---|
57.8 | 422. | Novoselova, Tsvetkova, et al., 1985 | DH |

Van Den Dool and Kratz RI, non-polar column, temperature ramp

Column type | Active phase | I | Reference | Comment |
---|---|---|---|---|
Capillary | VF-5MS | 2270. | Todua, 2011 | 30. m/0.25 mm/0.25 μm, He; Tstart: 60. C; Tend: 270. C |

Normal alkane RI, non-polar column, custom temperature program

Column type | Active phase | I | Reference | Comment |
---|---|---|---|---|
Capillary | RTX-5 MS | 2248. | Nadaf, Halimi, et al., 2012 | 15. m/0.25 mm/0.25 μm, Helium; Program: 35 0C (6 min) 5 0C/min -> 150 0C 10 0C/min -> 280 0C (3 min) |

References

Novoselova, Tsvetkova, et al., 1985
Novoselova, N.V.; Tsvetkova, L.Ya.; Rabinovich, I.B.; Moseeva, E.M.; Faminskaya, L.A.,
Specific heat and thermodynamic functions of 4,4'-dihydroxydiphenyl-2,2-propane, 4,4'-dichlorodiphenylsulphone, and polysulphone,
Zhur. Fiz. Khim., 1985, 59, 604-608. [all data]
Olah and Gupta, 1983
Olah, G.A.; Gupta, B.G.B.,
Onium Ions 27. Oxidation of Sulfoxides to Sulfones with Nitronium Salts,
J. Org. Chem., 1983, 48, 3585-7. [all data]
Novoselova, Tsvetkova, et al., 1985, 2
Novoselova, N.V.; Tsvetkova, L.Ya.; Rabinovich, I.B.; Moseeva, E.M.; Faminskaya, L.A.,
Heat Capacity and Thermodynamic Functions of 4,4'-Dihydroxydiphenyl- 2,2-propane, 4,4'-Dichlorodiphenyl sulfone and Polysulfone,
Zh. Fiz. Khim., 1985, 59, 604. [all data]
Dykyj, Svoboda, et al., 1999
Dykyj, J.; Svoboda, J.; Wilhoit, R.C.; Frenkel, M.L.; Hall, K.R.,
Vapor Pressure of Chemicals: Part A. Vapor Pressure and Antoine Constants for Hydrocarbons and Sulfur, Selenium, Tellurium and Hydrogen Containing Organic Compounds, Springer, Berlin, 1999, 373. [all data]
Domalski and Hearing, 1996
Domalski, Eugene S.; Hearing, Elizabeth D.,
Heat Capacities and Entropies of Organic Compounds in the Condensed Phase. Volume III,
J. Phys. Chem. Ref. Data, 1996, 25, 1, 1, https://doi.org/10.1063/1.555985
. [all data]
Todua, 2011
Todua, N.G.,
Retention Data. NIST Mass Spectrometry Data Center., NIST Mass Spectrometry Data Center, 2011. [all data]
Nadaf, Halimi, et al., 2012
Nadaf, M.; Halimi, M.; Mortazavi, M.,
Identification of nonpolar chemical composition Spartium junceum flower growing in Iran by GC-MS,
Middle-East J. Sci. Res., 2012, 11, 2, 221-224. [all data]