SiF3Cl+
- Formula: ClF3Si+
- Molecular weight: 120.533
- CAS Registry Number: 80040-81-9

Vibrational and/or electronic energy levels

Data compiled by: Marilyn E. Jacox
State: G
Energy (cm-1) |
Med. | Transition | λmin (nm) |
λmax (nm) |
References | ||
---|---|---|---|---|---|---|---|
Txx = 59870 ± 320 | gas | Cradock, Ebsworth, et al., 1973 | |||||
Vib. sym. |
No. | Approximate type of mode |
cm-1 | Med. | Method | References | |
---|---|---|---|---|---|---|---|
a1 | 1 | SiF3 stretch | 890 ± 40 | gas | PE | Cradock, Ebsworth, et al., 1973 | |
3 | Deformation | 200 ± 40 | gas | PE | Cradock, Ebsworth, et al., 1973 | ||
State: F
Energy (cm-1) |
Med. | Transition | λmin (nm) |
λmax (nm) |
References | ||
---|---|---|---|---|---|---|---|
Txx = 44210 ± 320 | gas | Cradock, Ebsworth, et al., 1973 | |||||
State: E
Energy (cm-1) |
Med. | Transition | λmin (nm) |
λmax (nm) |
References | ||
---|---|---|---|---|---|---|---|
Txx = 38890 ± 320 | gas | Cradock, Ebsworth, et al., 1973 | |||||
Vib. sym. |
No. | Approximate type of mode |
cm-1 | Med. | Method | References | |
---|---|---|---|---|---|---|---|
a1 | 1 | SiF3 stretch | 965 ± 40 | gas | PE | Cradock, Ebsworth, et al., 1973 | |
2 | SiCl stretch | 605 ± 40 | gas | PE | Cradock, Ebsworth, et al., 1973 | ||
State: D
Energy (cm-1) |
Med. | Transition | λmin (nm) |
λmax (nm) |
References | ||
---|---|---|---|---|---|---|---|
Txx = 32680 ± 320 | gas | Cradock, Ebsworth, et al., 1973 | |||||
State: C
Energy (cm-1) |
Med. | Transition | λmin (nm) |
λmax (nm) |
References | ||
---|---|---|---|---|---|---|---|
Txx = 26300 ± 320 | gas | Cradock, Ebsworth, et al., 1973 | |||||
State: B
Energy (cm-1) |
Med. | Transition | λmin (nm) |
λmax (nm) |
References | ||
---|---|---|---|---|---|---|---|
Txx = 23480 ± 320 | gas | Cradock, Ebsworth, et al., 1973 | |||||
State: A
Energy (cm-1) |
Med. | Transition | λmin (nm) |
λmax (nm) |
References | ||
---|---|---|---|---|---|---|---|
Txx = 15250 ± 320 | gas | Cradock, Ebsworth, et al., 1973 | |||||
Additional references: Jacox, 1994, page 295

References

Cradock, Ebsworth, et al., 1973
Cradock, S.; Ebsworth, E.A.V.; Robertson, A.,
Photoelectron spectra of some silyl and germyl transition-metal carbonyls and related specis,
J. Chem. Soc. Dalton Trans., 1973, 22. [all data]
Jacox, 1994
Jacox, M.E.,
Vibrational and electronic energy levels of polyatomic transient molecules, American Chemical Society, Washington, DC, 1994, 464. [all data]