Selenium chloride cyanide
- Formula: CClNSe
- Molecular weight: 140.43
- IUPAC Standard InChIKey: ZFELZZXATYXRGE-UHFFFAOYSA-N
- CAS Registry Number: 80039-76-5
- Chemical structure:
View 3d structure (requires JavaScript / HTML 5) - Permanent link for this species. Use this link for bookmarking this species for future reference.

Gas phase ion energetics data

Data compiled by: Sharon G. Lias, Rhoda D. Levin, and Sherif A. Kafafi
Ionization energy determinations
IE (eV) | Method | Reference | Comment |
---|---|---|---|
10.19 ± 0.02 | PE | Jonkers, Mooyman, et al., 1981 | Vertical value |

References

Jonkers, Mooyman, et al., 1981
Jonkers, G.; Mooyman, R.; De Lange, C.A.,
Ultraviolet photoelectron spectroscopy of unstable species: Nitrosyl cyanide (ONCN),
Chem. Phys., 1981, 57, 97. [all data]