Camphene
- Formula: C10H16
- Molecular weight: 136.2340
- IUPAC Standard InChIKey: CRPUJAZIXJMDBK-UHFFFAOYSA-N
- CAS Registry Number: 79-92-5
- Chemical structure:
View 3d structure (requires JavaScript / HTML 5) - Stereoisomers:
- Other names: Bicyclo[2.2.1]heptane, 2,2-dimethyl-3-methylene-; 2,2-Dimethyl-3-methylenebicyclo[2.2.1]heptane; 2,2-Dimethyl-3-methylenenorbornane; 3,3-Dimethyl-2-methylenenorbornane; 3,3-Dimethyl-2-methylenenorcamphane; NA 9011; (-)-camphene

Phase change data

Data compiled as indicated in comments:
TRC - Thermodynamics Research Center, NIST Boulder Laboratories, Chris Muzny director
AC - William E. Acree, Jr., James S. Chickos
ALS - Hussein Y. Afeefy, Joel F. Liebman, and Stephen E. Stein
DRB - Donald R. Burgess, Jr.
Quantity | Value | Units | Method | Reference | Comment |
---|---|---|---|---|---|
Tboil | 380. ± 100. | K | AVG | N/A | Average of 11 values; Individual data points |
Quantity | Value | Units | Method | Reference | Comment |
Tfus | 322. ± 8. | K | AVG | N/A | Average of 6 values; Individual data points |
Quantity | Value | Units | Method | Reference | Comment |
ΔvapH° | 44.7 | kJ/mol | GC | Hoskovec, Grygarová, et al., 2005 | Based on data from 313. to 413. K.; AC |
Quantity | Value | Units | Method | Reference | Comment |
ΔsubH° | 46.86 ± 0.54 | kJ/mol | C | Kozina, Bychikhina, et al., 1977 | ALS |
ΔsubH° | 47.0 | kJ/mol | N/A | Kozina, Bychikhina, et al., 1977 | DRB |
Enthalpy of vaporization
ΔvapH (kJ/mol) | Temperature (K) | Method | Reference | Comment |
---|---|---|---|---|
44.0 | 335. | A | Stephenson and Malanowski, 1987 | Based on data from 320. to 434. K. See also Stull, 1947.; AC |
Antoine Equation Parameters
log10(P) = A − (B / (T + C))
P = vapor pressure (bar)
T = temperature (K)
View plot Requires a JavaScript / HTML 5 canvas capable browser.
Temperature (K) | A | B | C | Reference | Comment |
---|---|---|---|---|---|
320.4 to 433.7 | 4.73866 | 1893.487 | -33.855 | Stull, 1947 | Coefficents calculated by NIST from author's data. |

Gas phase ion energetics data

Data compiled by: Sharon G. Lias, Rhoda D. Levin, and Sherif A. Kafafi
Ionization energy determinations
IE (eV) | Method | Reference |
---|---|---|
≤8.86 | PE | Nesmeyanov, Baiden, et al., 1981 |

Normal alkane RI, non-polar column, temperature ramp

Data compiled by: NIST Mass Spectrometry Data Center, William E. Wallace, director

Column type CapillaryCapillaryCapillaryCapillaryCapillary
Active phase HP-5 MSHP-1RTX-1RTX-1Mega-5
Column length (m) 60.30.60.60.25.
Carrier gas HeliumHeliumHeliumHeliumHelium
Substrate
Column diameter (mm) 0.250.250.220.220.25
Phase thickness (μm) 0.250.250.250.250.25
Tstart (C) 40.60.60.60.50.
Tend (C) 250.240.230.230.220.
Heat rate (K/min) 3.3.2.2.3.
Initial hold (min) 1.   1.
Final hold (min) 20. 5.5.5.
I 950.955.950.950.950.
ReferenceSardashti, Valizadeh, et al., 2013Alizadeh and Shaabani, 2012Bendiabdellah, El Amine Dib, et al., 2012Bendiabdellah, El Amine Dib, et al., 2012Dell'Agli, Sanna, et al., 2012
Comment MSDC-RI MSDC-RI MSDC-RI MSDC-RI MSDC-RI
Column type CapillaryCapillaryCapillaryCapillaryCapillary
Active phase HP-5 MSHP-5HP-5HP-5RTX-1
Column length (m) 30.25.25.25.60.
Carrier gas HeliumHydrogenHydrogenHydrogenHelium
Substrate
Column diameter (mm) 0.250.320.320.320.22
Phase thickness (μm) 0.250.520.520.520.25
Tstart (C) 40.40.40.40.60.
Tend (C) 250.280.280.280.230.
Heat rate (K/min) 3.4.4.4.2.
Initial hold (min) 1.
Final hold (min) 3.10.10.10.45.
I 954.941.942.942.940.
ReferenceJian-Yu, Zhu, et al., 2012Velickovic, Ristic, et al., 2012Velickovic, Ristic, et al., 2012Velickovic, Ristic, et al., 2012Yapi, Boti, et al., 2012
Comment MSDC-RI MSDC-RI MSDC-RI MSDC-RI MSDC-RI
Column type CapillaryCapillaryCapillaryCapillaryCapillary
Active phase HP-5 MSHP-5DB-5DB-5DB-5 MS
Column length (m) 30.30.25.30.30.
Carrier gas HeliumHeliumHeliumHeliumHelium
Substrate
Column diameter (mm) 0.250.250.200.250.25
Phase thickness (μm) 0.250.250.330.250.25
Tstart (C) 50.60.50.40.60.
Tend (C) 250.240.240.250.270.
Heat rate (K/min) 7.3.20.3.3.
Initial hold (min) 1. 1.5.
Final hold (min) 5.  20.
I 951.954.952.950.959.
ReferenceZouari, Ayadi, et al., 2012Bertoli, Lepnardi, et al., 2011Cais-Sokolinska, Majcher, et al., 2011Cao, Li, et al., 2011Cui, Yang, et al., 2011
Comment MSDC-RI MSDC-RI MSDC-RI MSDC-RI MSDC-RI
Column type CapillaryCapillaryCapillaryCapillaryCapillary
Active phase CP-Sil 5 CBDB-1HP-5 MSDB-5SE-30 MS
Column length (m) 25.30.30.30.30.
Carrier gas HydrogenHeliumHeliumHeliumHelium
Substrate
Column diameter (mm) 0.250.250.250.250.25
Phase thickness (μm) 0.150.250.250.250.25
Tstart (C) 50.40.35.60.50.
Tend (C) 230.210.250.240.250.
Heat rate (K/min) 3.5.5.3.5.
Initial hold (min)   3. 5.
Final hold (min)   10. 10.
I 956.959.947.953.953.
ReferenceEsseien, Aboaba, et al., 2011Fathi, Sahari, et al., 2011Kadri, Zarai, et al., 2011Karimi, Farmani, et al., 2011Menichini, Tundis, et al., 2011
Comment MSDC-RI MSDC-RI MSDC-RI MSDC-RI MSDC-RI
Column type CapillaryCapillaryCapillaryCapillaryCapillary
Active phase CP-Sil 5 CBMethylsiloxane + 5 % Ph-groupsHP-5HP-5 MSZB-5 MS
Column length (m) 30.30.30.30.30.
Carrier gas NitrogenHeliumNitrogenHeliumHelium
Substrate
Column diameter (mm) 0.250.250.250.250.25
Phase thickness (μm) 0.260.250.250.250.25
Tstart (C) 45.60.50.30.60.
Tend (C) 280.230.280.250.290.
Heat rate (K/min) 3.7.5.5.5.
Initial hold (min)  2.1.3.
Final hold (min) 22.20.1.10.
I 947.939.953.948.951.
ReferenceMothana, Hasson, et al., 2011Nadim, Malik, et al., 2011Tekaya-Karoui, Boughalleb, et al., 2011Zarai, Kadri, et al., 2011Boix, Victorio, et al., 2010
Comment MSDC-RI MSDC-RI MSDC-RI MSDC-RI MSDC-RI
Column type CapillaryCapillaryCapillaryCapillaryCapillary
Active phase ZB-5 MSRTX-1DB-5DB-5 MSSPB-1
Column length (m) 30.60.30.60.30.
Carrier gas HeliumHeliumHeliumHeliumHelium
Substrate
Column diameter (mm) 0.250.220.250.250.20
Phase thickness (μm) 0.250.250.250.250.20
Tstart (C) 60.60.50.40.70.
Tend (C) 290.230.250.250.220.
Heat rate (K/min) 5.2.2.5.3.
Initial hold (min)    15.
Final hold (min)  30. 15.15.
I 954.950.954.954.943.
ReferenceBoix, Victorio, et al., 2010Dib, Djabou, et al., 2010Ho, Wang, et al., 2010Mesa-Arango, Betancur-Galvis, et al., 2010Neves, Rosa, et al., 2010
Comment MSDC-RI MSDC-RI MSDC-RI MSDC-RI MSDC-RI
Column type CapillaryCapillaryCapillaryCapillaryCapillary
Active phase HP-5 MSHP-5 MSHP-5HP-5 MSSLB-5 MS
Column length (m) 30.30.30.30.10.
Carrier gas HeliumHeliumHydrogenHeliumHelium
Substrate
Column diameter (mm) 0.250.250.250.250.10
Phase thickness (μm) 0.250.250.250.250.10
Tstart (C) 60.100.70.60.50.
Tend (C) 220.220.290.220.250.
Heat rate (K/min) 5.2.5.6.10.
Initial hold (min) 10.  3.
Final hold (min)
I 953.949.955.950.946.
ReferenceOgunwande, Flamini, et al., 2010Pripdeevech, Chumpolsri, et al., 2010Radulovic, Dordevic, et al., 2010Safaei-Ghomi and Batooli, 2010Scandinaro, Tranchida, et al., 2010
Comment MSDC-RI MSDC-RI MSDC-RI MSDC-RI MSDC-RI
Column type CapillaryCapillaryCapillaryCapillaryCapillary
Active phase SLB-5 MSDB-5 MSDB-5DB-1-MSDB-1
Column length (m) 10.30.30.60.30.
Carrier gas HeliumHeliumHeliumHeliumHelium
Substrate
Column diameter (mm) 0.100.250.250.250.25
Phase thickness (μm) 0.100.250.250.250.25
Tstart (C) 50.60.40.30.50.
Tend (C) 250.240.240.200.220.
Heat rate (K/min) 10.3.3.2.4.
Initial hold (min)   1.4.2.
Final hold (min)    35.2.
I 949.954.928.940.939.
ReferenceScandinaro, Tranchida, et al., 2010Silva, Pott, et al., 2010de Souza, Lopes, et al., 2010Takeoka, Hobbs, et al., 2010Xu, Tang, et al., 2010
Comment MSDC-RI MSDC-RI MSDC-RI MSDC-RI MSDC-RI
Column type CapillaryCapillaryCapillaryCapillaryCapillary
Active phase DB-5HP-5MSDB-5OV-101SE-54
Column length (m) 30.30.30.50.30.
Carrier gas HeliumHeliumHeliumHeliumHelium
Substrate
Column diameter (mm) 0.250.250.250.250.25
Phase thickness (μm) 0.250.250.250.250.25
Tstart (C) 40.50.60.70.60.
Tend (C) 250.250.240.220.260.
Heat rate (K/min) 10.7.3.2.2.
Initial hold (min) 1.1.  5.
Final hold (min) 3.5.  999.
I 953.954.954.941.950.
ReferenceYang, Zhang, et al., 2010Zouari, Zouari, et al., 2010Alim, Goze, et al., 2009Benites, Moiteiro, et al., 2009Dayisoylu and Alma, 2009
Comment MSDC-RI MSDC-RI MSDC-RI MSDC-RI MSDC-RI
Column type CapillaryCapillaryCapillaryCapillaryCapillary
Active phase HP-5 MSDB-5DB-5RTX-1RTX-1
Column length (m) 30.30.30.60.60.
Carrier gas HeliumHeliumHeliumHeliumHelium
Substrate
Column diameter (mm) 0.250.250.250.220.22
Phase thickness (μm) 0.250.250.250.250.25
Tstart (C) 60.50.70.60.60.
Tend (C) 250.250.240.230.230.
Heat rate (K/min) 2.5.5.2.2.
Initial hold (min) 8.2.
Final hold (min) 15.  30.30.
I 955.954.951.944.950.
ReferenceFarhat, Ginies, et al., 2009Ho, Wang, et al., 2009Lawal and Oyedelji, 2009Museli, Pau, et al., 2009Museli, Pau, et al., 2009
Comment MSDC-RI MSDC-RI MSDC-RI MSDC-RI MSDC-RI
Column type CapillaryCapillaryCapillaryCapillaryCapillary
Active phase BP-1DB-5DB-55 % Phenyl methyl siloxaneDB-5
Column length (m) 50.30.30.60.30.
Carrier gas HeliumHeliumNitrogenHeliumNitrogen
Substrate
Column diameter (mm) 0.220.250.250.250.25
Phase thickness (μm) 0.250.250.250.250.25
Tstart (C) 60.45.40.90.40.
Tend (C) 220.250.250.225.230.
Heat rate (K/min) 2.3.3.3.2.
Initial hold (min)  3.1.
Final hold (min) 20.5.10.3.
I 944.950.954.955.954.
ReferenceOttavioli, Bighelli, et al., 2009Porto, Decorti, et al., 2009Rahimi-Nasrabadi, Gholivand, et al., 2009Retta, Gattuso, et al., 2009Scrivanti, Anton, et al., 2009
Comment MSDC-RI MSDC-RI MSDC-RI MSDC-RI MSDC-RI
Column type CapillaryCapillaryCapillaryCapillaryCapillary
Active phase DB-1 MSDB-5DB-5DB-5 MSHP-5MS
Column length (m) 30.50.30.30.30.
Carrier gas HeliumNitrogenHeliumHeliumHelium
Substrate
Column diameter (mm) 0.250.200.250.250.25
Phase thickness (μm) 0.250.320.250.250.25
Tstart (C) 40.60.40.40.50.
Tend (C) 250.220.240.250.240.
Heat rate (K/min) 6.5.3.4.5.
Initial hold (min) 1.3.1.2.
Final hold (min) 4.5. 2.
I 940.953.928.952.954.
ReferenceSeo, Kim, et al., 2009Shafaghat and Sadeghi, 2009de Souza, Lopes, et al., 2009Su, Wang, et al., 2009Wannes, Mhamdi, et al., 2009
Comment MSDC-RI MSDC-RI MSDC-RI MSDC-RI MSDC-RI
Column type CapillaryCapillaryCapillaryCapillaryCapillary
Active phase HP-5 MSHP-5HP-5 MSHP-5HP-5 MS
Column length (m) 30.30.30.30.30.
Carrier gas HeliumHelium N2Helium
Substrate
Column diameter (mm) 0.250.250.250.250.25
Phase thickness (μm) 0.250.25 0.250.25
Tstart (C) 50.50.60.60.50.
Tend (C) 280.280.280.220.230.
Heat rate (K/min) 4.9.3.5.4.
Initial hold (min)  3. 10.4.
Final hold (min)  3.  10.
I 947.952.948.955.953.
ReferenceZhao, Zeng, et al., 2009Aicha, Ines, et al., 2008Baziou, Couladis, et al., 2008Flamini, Tebano, et al., 2008Forero, Quijano, et al., 2008
Comment MSDC-RI MSDC-RI MSDC-RI MSDC-RI MSDC-RI
Column type CapillaryCapillaryCapillaryCapillaryCapillary
Active phase HP-5VF-5MSSLB-5 MSZB-1DB-5
Column length (m) 30.30.30.30.60.
Carrier gas HeliumHeliumHeliumNitrogenNitrogen
Substrate
Column diameter (mm) 0.250.250.250.250.25
Phase thickness (μm) 0.250.250.250.250.25
Tstart (C) 50.240.50.45.60.
Tend (C) 300.320.250.230.250.
Heat rate (K/min) 3.20.3.3.5.
Initial hold (min)  1.2.
Final hold (min) 30. 10. 10.
I 950.929.949.942.952.
ReferenceIsidorov, Lech, et al., 2008Kowalski, 2008Lo Presti, Sciarrone, et al., 2008Mierendorff, Stahl-Biskup, et al., 2008Mosayebi, Amin, et al., 2008
Comment MSDC-RI MSDC-RI MSDC-RI MSDC-RI MSDC-RI
Column type CapillaryCapillaryCapillaryCapillaryCapillary
Active phase Elite-1HP-5 MSHP-5RTX-5HP-5
Column length (m) 30.30.30.20.25.
Carrier gas HeliumHeliumNitrogenHeliumHelium
Substrate
Column diameter (mm) 0.320.250.250.180.25
Phase thickness (μm) 0.250.250.250.200.25
Tstart (C) 60.60.50.50.60.
Tend (C) 246.250.280.280.240.
Heat rate (K/min) 3.2.5.4.4.
Initial hold (min)  8.1.1.2.
Final hold (min)  15.1.
I 944.943.962.951.955.
ReferenceRaj, Baby, et al., 2008Sahraoui, Vian, et al., 2008Saidana, Mahjoub, et al., 2008Skalicka-Wozniak, Los, et al., 2008Verdian-rizi, 2008
Comment MSDC-RI MSDC-RI MSDC-RI MSDC-RI MSDC-RI
Column type CapillaryCapillaryCapillaryCapillaryCapillary
Active phase OV-1HP-5HP-5 MSDB-5DB-5MS
Column length (m) 30.30.30.50.30.
Carrier gas HeliumHeliumHeliumNitrogenHe
Substrate
Column diameter (mm) 0.250.250.250.200.25
Phase thickness (μm) 0.250.320.250.320.25
Tstart (C) 65.60.50.60.60.
Tend (C) 260.250.230.220.240.
Heat rate (K/min) 6.5.3.5.3.
Initial hold (min)  30.10.3.
Final hold (min)   10.5.
I 981.952.953.947.952.
ReferenceWang, Yi, et al., 2008Yassa and Akhani, 2008Adams, Beauchamp, et al., 2007Amiri, 2007Andrade, Oliveira, et al., 2007
Comment MSDC-RI MSDC-RI MSDC-RI MSDC-RI MSDC-RI
Column type CapillaryCapillaryCapillaryCapillaryCapillary
Active phase HP-5 MSCP Sil 5 CBHP-5MSSE-52DB-5
Column length (m) 30.30.30.30.30.
Carrier gas HeliumN2He He
Substrate
Column diameter (mm) 0.250.320.250.250.26
Phase thickness (μm) 0.250.250.250.250.25
Tstart (C) 60.60.60.50.60.
Tend (C) 200.300.280.220.240.
Heat rate (K/min) 4.4.3.3.3.
Initial hold (min)    1.
Final hold (min) 20.  5.
I 969.945.950.943.944.
ReferenceAraque, Rojas, et al., 2007Baran, von Reuss, et al., 2007Basta, Pavlovic, et al., 2007Bicchi, Cordero, et al., 2007Bos, Woerdenbag, et al., 2007
Comment MSDC-RI MSDC-RI MSDC-RI MSDC-RI MSDC-RI
Column type CapillaryCapillaryCapillaryCapillaryCapillary
Active phase HP-5MSHP-5DB-5DB-5HP-5MS
Column length (m) 30.30.60.30.30.
Carrier gas HeN2HeHeliumHe
Substrate
Column diameter (mm) 0.250.250.250.260.25
Phase thickness (μm) 0.250.250.250.250.25
Tstart (C) 60.50.40.60.60.
Tend (C) 280.240.220.290.250.
Heat rate (K/min) 3.5.3.3.2.
Initial hold (min)  1.  8.
Final hold (min)  4.  15.
I 951.953.960.944.942.
ReferenceBozin B., Mlmica-Dukic N., et al., 2007Cheraif, Ben Jannet, et al., 2007Chyau, Tsai, et al., 2007Elfami, Bos, et al., 2007Ferhat, Meklati, et al., 2007
Comment MSDC-RI MSDC-RI MSDC-RI MSDC-RI MSDC-RI
Column type CapillaryCapillaryCapillaryCapillaryCapillary
Active phase ZP-5DB-1DB-5Col-Elite 5MSDBP-5
Column length (m) 60.60.30.30.25.
Carrier gas HeNitrogenHeHeHelium
Substrate
Column diameter (mm) 0.250.250.250.250.25
Phase thickness (μm) 0.250.250.250.250.22
Tstart (C) 40.60.60.30.40.
Tend (C) 260.250.210.246.250.
Heat rate (K/min) 6.4.30.3.3.
Initial hold (min) 7.1.3. 1.
Final hold (min) 1.10.  10.
I 958.950.942.951.924.
ReferenceFüssel, Dötterl, et al., 2007Ghasempour, Shirinpour, et al., 2007Ghasemi, Yamini, et al., 2007Gudaityte and Venskutonis R.P., 2007Heravi and Sereshti, 2007
Comment MSDC-RI MSDC-RI MSDC-RI MSDC-RI MSDC-RI
Column type CapillaryCapillaryCapillaryCapillaryCapillary
Active phase SE-30HP-5DB-5MSZB-5DB-1
Column length (m) 30.30.30.30.30.
Carrier gas HeHeHe Helium
Substrate
Column diameter (mm) 0.250.250.250.250.25
Phase thickness (μm) 0.250.250.250.250.25
Tstart (C) 40.40.60.60.50.
Tend (C) 250.250.280.220.260.
Heat rate (K/min) 5.5.3.4.2.5
Initial hold (min) 5.5. 5.1.
Final hold (min) 10.10.30.20.20.
I 953.951.929.948.937.
ReferenceLoizzo, Tundis, et al., 2007Loizzo, Tundis, et al., 2007Marongiu B., Piras A., et al., 2007Mohottalage, Tabacchi, et al., 2007Monser-Esfahani, Karamkhani, et al., 2007
Comment MSDC-RI MSDC-RI MSDC-RI MSDC-RI MSDC-RI
Column type CapillaryCapillaryCapillaryCapillaryCapillary
Active phase DB-5HP-5Methyl SiliconeDB-1SPB-1
Column length (m) 30.25.50.50.30.
Carrier gas HeH2HeliumHeHe
Substrate
Column diameter (mm) 0.250.20.250.250.2
Phase thickness (μm) 0.320.33 0.250.2
Tstart (C) 50.60.50.95.70.
Tend (C) 250.240.240.240.220.
Heat rate (K/min) 5.3.3.4.3.
Initial hold (min)
Final hold (min)     15.
I 946.953.953.938.943.
ReferenceNori-Shargh, Raftari, et al., 2007Oliveira, Leitão, et al., 2007Ozcan and Chalchat, 2007Pala-Paul, Brophy, et al., 2007Pinto, Salgueiro, et al., 2007
Comment MSDC-RI MSDC-RI MSDC-RI MSDC-RI MSDC-RI
Column type CapillaryCapillaryCapillaryCapillaryCapillary
Active phase SPB-5BPX-5DB-1DB-1DB-1
Column length (m) 30.50.60.60.60.
Carrier gas HeHeNitrogen He
Substrate
Column diameter (mm) 0.250.220.250.250.25
Phase thickness (μm) 0.251.0.250.250.25
Tstart (C) 50.50.60.60.60.
Tend (C) 250.300.250.250.250.
Heat rate (K/min) 2.4.4.5.5.
Initial hold (min)  1.1.
Final hold (min)  10.10.
I 945.972.950.945.950.
ReferenceRaal, Orav, et al., 2007Rali, Wossa, et al., 2007Reza, Ebrahim, et al., 2007Salehi, Asghari, et al., 2007Salehi, Fakhari, et al., 2007
Comment MSDC-RI MSDC-RI MSDC-RI MSDC-RI MSDC-RI
Column type CapillaryCapillaryCapillaryCapillaryCapillary
Active phase DB-5DBP-5DB-5DB-5Elite-5MS
Column length (m) 30.25.30.30.30.
Carrier gas HeHeliumHe He
Substrate
Column diameter (mm) 0.250.250.250.250.32
Phase thickness (μm) 0.250.220.250.250.5
Tstart (C) 50.40.60.40.40.
Tend (C) 240.250.320.250.280.
Heat rate (K/min) 4.3.10.2.4.
Initial hold (min)  1.  5.
Final hold (min)  10.4.33.10.
I 950.924.953.951.949.
ReferenceSefidkon, Abbasi, et al., 2007Sereshti and Samadi, 2007Smelcerovic, Spiteller, et al., 2007Sylvestre, Pichette, et al., 2007Tava, Pecetti, et al., 2007
Comment MSDC-RI MSDC-RI MSDC-RI MSDC-RI MSDC-RI
Column type CapillaryCapillaryCapillaryCapillaryCapillary
Active phase HP-5 MSHP-5MSHP-5 MSHP-5MSHP-5
Column length (m) 30.30.30.30.30.
Carrier gas HeliumHeHeliumHeHe
Substrate
Column diameter (mm) 0.250.250.250.250.25
Phase thickness (μm) 0.250.250.250.250.32
Tstart (C) 60.60.60.40.60.
Tend (C) 280.280.280.250.250.
Heat rate (K/min) 3.3.3.3.5.
Initial hold (min)    5.30.
Final hold (min)    10.
I 953.930.954.942.952.
ReferenceTsokou, Georgopoulos, et al., 2007Tzakou, Bazos, et al., 2007Vagionas, Graikou, et al., 2007Vichi, Riu-Aumatell, et al., 2007Yassa and Akhani, 2007
Comment MSDC-RI MSDC-RI MSDC-RI MSDC-RI MSDC-RI
Column type CapillaryCapillaryCapillaryCapillaryCapillary
Active phase HP-5HP-5DB-5ZB-5AT-5
Column length (m) 30.30.30.30.60.
Carrier gas N2N2He He
Substrate
Column diameter (mm) 0.250.250.250.250.25
Phase thickness (μm) 0.250.250.250.250.25
Tstart (C) 50.50.50.40.60.
Tend (C) 280.280.265.300.200.
Heat rate (K/min) 9.9.2.52.4.
Initial hold (min) 3.3.1.
Final hold (min) 3.3.20. 20.
I 949.952.949.950.956.
ReferenceAbdelwahed, Hayder, et al., 2006Abdelwahed, Hayder, et al., 2006Bazargani, Almasirad, et al., 2006Biondi, Sari, et al., 2006Borges, Rojas, et al., 2006
Comment MSDC-RI MSDC-RI MSDC-RI MSDC-RI MSDC-RI
Column type CapillaryCapillaryCapillaryCapillaryCapillary
Active phase HP-5MSHP-1SPB-1DB-1DB-5
Column length (m) 30.50.30.60.30.
Carrier gas HeHeHeliumNitrogenN2
Substrate
Column diameter (mm) 0.250.20.200.250.25
Phase thickness (μm) 0.250.50.20 0.25
Tstart (C) 60.60.70.40.70.
Tend (C) 280.250.220.200.230.
Heat rate (K/min) 3.2.3.2.2.
Initial hold (min)    1.2.
Final hold (min)  120.15.9.20.
I 951.943.943.943.955.
ReferenceBozin, Mimicá-Dukic, et al., 2006Castel, Fernandez, et al., 2006Cavaleiro, Pinto, et al., 2006Chen, Sheu, et al., 2006Choi, 2006
Comment MSDC-RI MSDC-RI MSDC-RI MSDC-RI MSDC-RI
Column type CapillaryCapillaryCapillaryCapillaryCapillary
Active phase HP-5DB-5HP-5MSDB-5HP-5MS
Column length (m) 30.30.30.30.30.
Carrier gas He  HeliumHe
Substrate
Column diameter (mm) 0.320.320.250.260.25
Phase thickness (μm) 0.250.250.250.250.25
Tstart (C) 60.60.60.60.50.
Tend (C) 246.230.280.290.250.
Heat rate (K/min) 3.3.4.3.2.
Initial hold (min)
Final hold (min)  15.
I 952.953.955.944.953.
ReferenceCoronel, Cerda-Garcia-Rojas, et al., 2006Damjanovic, Skala, et al., 2006Ebrahim Sajjadi and Mehregan, 2006Elfami, Komar, et al., 2006Farah, Afifi, et al., 2006
Comment MSDC-RI MSDC-RI MSDC-RI MSDC-RI MSDC-RI
Column type CapillaryCapillaryCapillaryCapillaryCapillary
Active phase HP-5HP-1DB-5DB-5DB-5
Column length (m) 30.50.30.30.30.
Carrier gas HeHeHeHeHe
Substrate
Column diameter (mm) 0.250.20.250.250.25
Phase thickness (μm) 0.250.330.250.250.25
Tstart (C) 50.60.60.60.50.
Tend (C) 300.250.240.240.250.
Heat rate (K/min) 5.2.5.5.3.
Initial hold (min) 5. 2.2.
Final hold (min) 5.40.  10.
I 949.944.950.950.951.
ReferenceFiguérédo, Cabassu, et al., 2006Filippi, Lanfranchi, et al., 2006Gohari, Hadjiakhoondi, et al., 2006Gohari A.R., Hadjiakhoondi A., et al., 2006Havlik, Kokoska, et al., 2006
Comment MSDC-RI MSDC-RI MSDC-RI MSDC-RI MSDC-RI
Column type CapillaryCapillaryCapillaryCapillaryCapillary
Active phase DB-5HP-5MSHP-5MSHP-5MSMethyl Silicone
Column length (m) 30.30.30.30.25.
Carrier gas HeliumHeHeHeHe
Substrate
Column diameter (mm) 0.250.250.250.250.25
Phase thickness (μm) 0.250.250.250.250.25
Tstart (C) 60.50.50.50.90.
Tend (C) 260.280.280.280.220.
Heat rate (K/min) 3.5.5.5.7.
Initial hold (min)  4.4.4.2.
Final hold (min)  10.10.10.
I 952.953.956.953.946.
ReferenceJavidnia, Miri, et al., 2006Kim, Abd El-Aty, et al., 2006Kim, Abd El-Aty, et al., 2006Kim, El-Aty, et al., 2006Kitchlu, Bakshi, et al., 2006
Comment MSDC-RI MSDC-RI MSDC-RI MSDC-RI MSDC-RI
Column type CapillaryCapillaryCapillaryCapillaryCapillary
Active phase HP-5RTX-1CP Sil 5 CBCP Sil 5 CBCP Sil 5 CB
Column length (m) 30.30.30.30.30.
Carrier gas HeliumHeN2N2N2
Substrate
Column diameter (mm) 0.320.320.250.320.25
Phase thickness (μm) 0.250.250.250.250.25
Tstart (C) 60.60.60.50.50.
Tend (C) 260.300.300.300.200.
Heat rate (K/min) 5.4.5.4.5.
Initial hold (min) 2. 4.
Final hold (min) 13.
I 954.948.943.939.948.
ReferenceKucuk, Gulec, et al., 2006Kula, Izydorczyk, et al., 2006Kurowska and Galazka, 2006Lis and Milczarek, 2006Martin, Joseph, et al., 2006
Comment MSDC-RI MSDC-RI MSDC-RI MSDC-RI MSDC-RI
Column type CapillaryCapillaryCapillaryCapillaryCapillary
Active phase HP-5 MSHP-55 % Phenyl methyl siloxaneHP-101DB-5
Column length (m) 30.30.30.25.30.
Carrier gas NitrogenN2HeliumHeHelium
Substrate
Column diameter (mm) 0.250.250.250.20.25
Phase thickness (μm) 0.250.520.250.20.25
Tstart (C) 50.50.60.70.50.
Tend (C) 280.280.280.200.250.
Heat rate (K/min) 5.5.3.3.3.
Initial hold (min)    2.5.
Final hold (min) 5.5.30.15.
I 950.950.928.953.948.
ReferenceMarzouk, Mansour, et al., 2006Marzouk, Neffati, et al., 2006Marongiu, Piras, et al., 2006Mastelic, Jerkovic, et al., 2006Mirza, Navaei, et al., 2006
Comment MSDC-RI MSDC-RI MSDC-RI MSDC-RI MSDC-RI
Column type CapillaryCapillaryCapillaryCapillaryCapillary
Active phase DB-5DB-5DB-5CP-Sil 5 CBNB-30
Column length (m) 30.30.30.25.30.
Carrier gas HeHeHeHydrogenHe
Substrate
Column diameter (mm) 0.250.250.250.250.2
Phase thickness (μm) 0.250.250.250.150.25
Tstart (C) 60.60.50.50.50.
Tend (C) 220.220.250.230.250.
Heat rate (K/min) 4.4.4.3.2.
Initial hold (min) 5.5.
Final hold (min)
I 956.956.952.955.943.
ReferenceMorteza-Semnani K., Akbarzadeh M., et al., 2006Morteza-Semnani K., Saeedi M., et al., 2006Najafpour Navaei, Mirza, et al., 2006Olawore, Usman, et al., 2006Orav, Raal, et al., 2006
Comment MSDC-RI MSDC-RI MSDC-RI MSDC-RI MSDC-RI
Column type CapillaryCapillaryCapillaryCapillaryCapillary
Active phase DB-5SE-52DB-1HP-5MSDB-5
Column length (m) 25.50.50.30.30.
Carrier gas N2HeliumN2HeHydrogen
Substrate
Column diameter (mm) 0.250.250.250.250.25
Phase thickness (μm) 0.15 0.250.250.25
Tstart (C) 50.50.95.40.70.
Tend (C) 200.240.240.260.280.
Heat rate (K/min) 4.3.4.4.4.
Initial hold (min) 3.   4.
Final hold (min)
I 955.953.953.952.953.
ReferenceOuamba, Ouabonzi, et al., 2006Ozcan, Chalchat, et al., 2006Pala-Paul J., Perez-Alonso M.J., et al., 2006Petrovic, Ristic, et al., 2006Pino, Marbot, et al., 2006
Comment MSDC-RI MSDC-RI MSDC-RI MSDC-RI MSDC-RI
Column type CapillaryCapillaryCapillaryCapillaryCapillary
Active phase DB-5DB-5HP-5MSDB-5DB-5
Column length (m) 30.30.30.30.30.
Carrier gas HydrogenHydrogenHeHeHe
Substrate
Column diameter (mm) 0.250.250.250.250.25
Phase thickness (μm) 0.250.250.250.250.25
Tstart (C) 70.70.60.60.60.
Tend (C) 280.280.280.200.260.
Heat rate (K/min) 4.4.3.2.5.
Initial hold (min) 4.4.
Final hold (min)    60.
I 953.952.930.953.951.
ReferencePino, Marbot, et al., 2006Pino, Marbot, et al., 2006Pitarokili, Tzakou, et al., 2006Rout, Naik, et al., 2006Sabulal, Dan, et al., 2006
Comment MSDC-RI MSDC-RI MSDC-RI MSDC-RI MSDC-RI
Column type CapillaryCapillaryCapillaryCapillaryCapillary
Active phase ZB-5DB-1FSOT-RSL-200DB-5DB-5
Column length (m) 30.60.30.30.30.
Carrier gas He HydrogenHeHe
Substrate
Column diameter (mm) 0.250.250.320.250.25
Phase thickness (μm) 0.250.250.250.250.25
Tstart (C) 40.70.40.50.40.
Tend (C) 300.230.280.240.240.
Heat rate (K/min) 2.2.6.4.4.
Initial hold (min)  2.5.
Final hold (min)  20.5.
I 950.949.953.951.952.
ReferenceSari M., Biondi D.M., et al., 2006Sawamura, Onishi, et al., 2006Schmidt, Jirovetz, et al., 2006Sefidkon, Abbasi, et al., 2006Sefidkon and Jamzad, 2006
Comment MSDC-RI MSDC-RI MSDC-RI MSDC-RI MSDC-RI
Column type CapillaryCapillaryCapillaryCapillaryCapillary
Active phase DB-1HP-5DB-1CP Sil 5 CBSPB-5
Column length (m) 60.25.60.25.60.
Carrier gas HeN2Helium He
Substrate
Column diameter (mm) 0.250.20.250.250.32
Phase thickness (μm)  0.330.25 1.
Tstart (C) 40.30.60.50.40.
Tend (C) 250.280.250.230.230.
Heat rate (K/min) 4.3.5.3.3.
Initial hold (min)     5.
Final hold (min)   10. 2.
I 953.954.948.950.961.
ReferenceSefidkon, Jamzad, et al., 2006Shafi, Jose, et al., 2006Sonboli, Mirjalili, et al., 2006Tesso, Kubeczka, et al., 2006Tornambe, Cornu, et al., 2006
Comment MSDC-RI MSDC-RI MSDC-RI MSDC-RI MSDC-RI
Column type CapillaryCapillaryCapillaryCapillaryCapillary
Active phase DB-5DB-1SPB-1SPB-1DB-5
Column length (m) 30.50.50.30.30.
Carrier gas N2N2HeHeHe
Substrate
Column diameter (mm) 0.250.250.20.250.25
Phase thickness (μm) 0.250.250.330.250.25
Tstart (C) 60.90.50.50.40.
Tend (C) 240.240.220.250.250.
Heat rate (K/min) 4.4.4.4.4.
Initial hold (min)   1.1.
Final hold (min)   10.10.
I 952.938.940.943.947.
ReferenceTrilles, Bombarda, et al., 2006Velasco-Negueruela, Pérez-Alonso, et al., 2006Wong, Lim, et al., 2006Wong, Sivasothy, et al., 2006Yadegarinia, Gachkar, et al., 2006
Comment MSDC-RI MSDC-RI MSDC-RI MSDC-RI MSDC-RI
Column type CapillaryCapillaryCapillaryCapillaryCapillary
Active phase HP-5MSDB-5DB-5MSDB-5Methyl Silicone
Column length (m) 30.30.30.50.60.
Carrier gas HeHeHe He
Substrate
Column diameter (mm) 0.250.2490.250.30.3
Phase thickness (μm) 0.250.250.250.25
Tstart (C) 60.60.60.60.50.
Tend (C) 280.290.240.240.240.
Heat rate (K/min) 3.3.3.2.3.
Initial hold (min)
Final hold (min)
I 944.945.954.950.949.
ReferenceBasta, Tzakou, et al., 2005Bos, Stojanova, et al., 2005Busman, Zoghbi, et al., 2005Chagonda and Chalchat, 2005Chalchat and Özcan, 2005
Comment MSDC-RI MSDC-RI MSDC-RI MSDC-RI MSDC-RI
Column type CapillaryCapillaryCapillaryCapillaryCapillary
Active phase SPB-5HP-5DB-1DB-1HP-1
Column length (m) 60.25.30.60.50.
Carrier gas HeHeHeHe
Substrate
Column diameter (mm) 0.320.20.250.250.2
Phase thickness (μm) 1.0.330.250.250.25
Tstart (C) 40.60.60.60.60.
Tend (C) 230.240.250.250.250.
Heat rate (K/min) 3.3.5.5.2.
Initial hold (min) 5. 5. 60.
Final hold (min)  7.15.
I 961.945.955.950.944.
ReferenceCornu, Kondjoyan, et al., 2005Duarte, Figueira, et al., 2005Facundo, Pinto, et al., 2005Fakhari, Salehi, et al., 2005Fernandez, Lizzani-Cuvelier, et al., 2005
Comment MSDC-RI MSDC-RI MSDC-RI MSDC-RI MSDC-RI
Column type CapillaryCapillaryCapillaryCapillaryCapillary
Active phase HP-5HP-5MSDB-5RSL-200DB-1
Column length (m) 30.25.30.30.30.
Carrier gas HeHeHe He
Substrate
Column diameter (mm) 0.250.250.250.250.25
Phase thickness (μm) 0.25 0.250.250.25
Tstart (C) 50.50.40.40.50.
Tend (C) 300.250.280.280.265.
Heat rate (K/min) 5.3.8.6.2.5
Initial hold (min) 5.3. 2.1.
Final hold (min) 5.10. 10.30.
I 949.952.946.956.941.
ReferenceFiguérédo, Cabassu, et al., 2005Ghasemi Y., Faridi P., et al., 2005Jelén, Krawczyk, et al., 2005Jirovetz, Buchbauer, et al., 2005Khalighi-Sigaroodi, Hadijiakhoondi, et al., 2005
Comment MSDC-RI MSDC-RI MSDC-RI MSDC-RI MSDC-RI
Column type CapillaryCapillaryCapillaryCapillaryCapillary
Active phase DB-5DB-5DB-5DB-5HP-5MS
Column length (m) 30.30.30.30.30.
Carrier gas HeHe Helium
Substrate
Column diameter (mm) 0.320.320.250.250.25
Phase thickness (μm)   0.250.250.25
Tstart (C) 60.60.35.35.38.
Tend (C) 240.240.280.280.220.
Heat rate (K/min) 3.3.4.4.5.
Initial hold (min)   2.2.1.
Final hold (min)     2.
I 955.956.946.946.946.
ReferenceKhayyat and Karimi, 2005Khayyat and Karimi, 2005Kowalski and Wolski, 2005Kowalski, 2005Krist, Stuebiger, et al., 2005
Comment MSDC-RI MSDC-RI MSDC-RI MSDC-RI MSDC-RI
Column type CapillaryCapillaryCapillaryCapillaryCapillary
Active phase DB-5DB-5MSDB-5CP Sil 5 CBDB-5
Column length (m) 30.30.30.25.30.
Carrier gas HeHeHe He
Substrate
Column diameter (mm) 0.250.250.250.250.32
Phase thickness (μm) 0.250.250.250.150.25
Tstart (C) 60.60.60.50.40.
Tend (C) 230.280.220.230.250.
Heat rate (K/min) 3.3.4.3.5.
Initial hold (min)  30.5. 0.5
Final hold (min)     2.
I 943.933.954.951.953.
ReferenceLimberger, Sobral, et al., 2005Marongiu, Piras, et al., 2005Morteza-Semnani, Akbarzadeh, et al., 2005Ogunwande, Olawore, et al., 2005Özel, Gögüs, et al., 2005
Comment MSDC-RI MSDC-RI MSDC-RI MSDC-RI MSDC-RI
Column type CapillaryCapillaryCapillaryCapillaryCapillary
Active phase HP-5MSCP Sil 5 CBCP Sil 5 CBHP-5HP-5MS
Column length (m) 30.30.30.30.30.
Carrier gas  HeHeHeHe
Substrate
Column diameter (mm) 0.20.250.250.250.25
Phase thickness (μm)  0.250.25 0.25
Tstart (C) 60.40.40.60.60.
Tend (C) 280.220.220.240.275.
Heat rate (K/min) 3.4.4.5.4.
Initial hold (min)  1.1.
Final hold (min)
I 954.954.954.950.950.
ReferencePetrakis, Roussis, et al., 2005Rohloff and Bones, 2005Rohloff and Bones, 2005Saeidnia, Gohari, et al., 2005Sajjadi and Ghannadi, 2005
Comment MSDC-RI MSDC-RI MSDC-RI MSDC-RI MSDC-RI
Column type CapillaryCapillaryCapillaryCapillaryCapillary
Active phase DB-5DB-5PE-5DB-5HP-5MS
Column length (m) 30.30.30.30.30.
Carrier gas HeHeH2HeHe
Substrate
Column diameter (mm) 0.250.250.320.250.25
Phase thickness (μm) 0.25 0.250.250.25
Tstart (C) 60.40.60.60.60.
Tend (C) 220.240.230.230.280.
Heat rate (K/min) 3.4.5.3.3.
Initial hold (min) 4. 2.
Final hold (min)   4.20.
I 950.952.947.954.944.
ReferenceSalehi, Sefidkon, et al., 2005Sefidkon and Jamzad, 2005Singh, Raina, et al., 2005Skoula and Grayer, 2005Slavkovska, Couladis, et al., 2005
Comment MSDC-RI MSDC-RI MSDC-RI MSDC-RI MSDC-RI
Column type CapillaryCapillaryCapillaryCapillaryCapillary
Active phase RTX-1DB-5HP-5MSHP-5 MSHP-5MS
Column length (m) 60.30.30.30.30.
Carrier gas He HeHeHe
Substrate
Column diameter (mm) 0.250.250.250.250.25
Phase thickness (μm) 0.250.250.250.500.25
Tstart (C) 60.40.50.60.60.
Tend (C) 250.210.240.260.280.
Heat rate (K/min) 5.2.3.3.3.
Initial hold (min)  2.3.
Final hold (min) 10.33. 20.
I 952.953.932.953.930.
ReferenceSonboli A., Fakhari A.R., et al., 2005Stevanovic, Garneau, et al., 2005Tepe B., Sokmen M., et al., 2005Topçu, Barla, et al., 2005Tzakou, Bazos, et al., 2005
Comment MSDC-RI MSDC-RI MSDC-RI MSDC-RI MSDC-RI
Column type CapillaryCapillaryCapillaryCapillaryCapillary
Active phase DB-1DB-1HP-5MSSPB-1CP Sil 5 CB
Column length (m) 50.50.30.50.30.
Carrier gas N2  HeN2
Substrate
Column diameter (mm) 0.250.250.250.20.25
Phase thickness (μm) 0.250.250.250.330.25
Tstart (C) 90.60.40.50.50.
Tend (C) 240.240.220.220.200.
Heat rate (K/min) 4.3.3.4.5.
Initial hold (min)   5.3.
Final hold (min)   10.30.
I 938.937.942.946.952.
ReferenceVelasco-Negueruela, Pérez-Alonso, et al., 2005Velasco-Negueruela, Pérez-Alonso, et al., 2005, 2Vichi, Riu-Aumatell, et al., 2005Wong, Lee, et al., 2005Agnaniet, Menut, et al., 2004
Comment MSDC-RI MSDC-RI MSDC-RI MSDC-RI MSDC-RI
Column type CapillaryCapillaryCapillaryCapillaryCapillary
Active phase BP-1DB-1SPB-5DB-5ZB-5
Column length (m) 50.60.60.25.60.
Carrier gas  N2HeNitrogenHe
Substrate
Column diameter (mm) 0.220.250.320.250.25
Phase thickness (μm) 0.250.251.0.250.25
Tstart (C) 60.70.60.60.40.
Tend (C) 220.230.200.240.260.
Heat rate (K/min) 2.2.4.3.6.
Initial hold (min)  2.  4.6
Final hold (min) 20.20.30. 1.
I 944.954.953.949.963.
ReferenceBlanc, Muselli, et al., 2004Choi, 2004Gauvin, Ravaomanarivo, et al., 2004JAvidnia, Mojab, et al., 2004Jürgens and Dötterl, 2004
Comment MSDC-RI MSDC-RI MSDC-RI MSDC-RI MSDC-RI
Column type CapillaryCapillaryCapillaryCapillaryCapillary
Active phase DB-5RTX-1SE-54RTX-1DB-5
Column length (m) 60.30.30.30.30.
Carrier gas HeN2HeN2
Substrate
Column diameter (mm) 0.250.250.250.320.25
Phase thickness (μm) 0.250.250.250.250.25
Tstart (C) 40.60.60.60.40.
Tend (C) 280.300.260.300.210.
Heat rate (K/min) 4.4.2.4.2.
Initial hold (min) 4. 5. 2.
Final hold (min)     33.
I 949.950.949.944.952.
ReferenceKalvandi, Sefidkon, et al., 2004Kalemba and Thiem, 2004Kilic, Hafizoglu, et al., 2004Lis, Boczek, et al., 2004Lopez Arze, Collin, et al., 2004
Comment MSDC-RI MSDC-RI MSDC-RI MSDC-RI MSDC-RI
Column type CapillaryCapillaryCapillaryCapillaryCapillary
Active phase BP-1DB-5MSHP-5MSNB-30NB-30
Column length (m) 25.30.30.50.50.
Carrier gas N2HeHeHeHe
Substrate
Column diameter (mm) 0.250.250.250.20.2
Phase thickness (μm) 0.250.250.250.250.25
Tstart (C) 60.60.60.50.50.
Tend (C) 220.280.280.250.250.
Heat rate (K/min) 5.3.3.2.2.
Initial hold (min)
Final hold (min)  30.
I 946.924.952.945.945.
ReferenceMallavarapu, Kulkarni, et al., 2004Marongiu, Porcedda, et al., 2004Mimica-Dukic, Bozin, et al., 2004Orav, Stulova, et al., 2004Orav, Stulova, et al., 2004
Comment MSDC-RI MSDC-RI MSDC-RI MSDC-RI MSDC-RI
Column type CapillaryCapillaryCapillaryCapillaryCapillary
Active phase DB-1NB-30NB-30DB-5Methyl Silicone
Column length (m) 50.50.50.30.60.
Carrier gas N2HeHeHeHe
Substrate
Column diameter (mm) 0.250.20.200.250.25
Phase thickness (μm) 0.250.250.250.250.25
Tstart (C) 95.50.50.35.60.
Tend (C) 240.250.250.220.200.
Heat rate (K/min) 4.2.2.2.54.
Initial hold (min)     1.
Final hold (min)    6.20.
I 943.945.943.954.949.
ReferencePalá-Paúl, Velasco-Negueruela, et al., 2004Raal, Arak, et al., 2004Raal, Paaver, et al., 2004Rohloff, Mordal, et al., 2004Rojas, Usubillaga, et al., 2004
Comment MSDC-RI MSDC-RI MSDC-RI MSDC-RI MSDC-RI
Column type CapillaryCapillaryCapillaryCapillaryCapillary
Active phase HP-5 MSHP-5MSHP-5MSDB-1DB-1
Column length (m) 30.30.30.60.60.
Carrier gas HeliumHeHe Nitrogen
Substrate
Column diameter (mm) 0.250.250.250.250.25
Phase thickness (μm) 0.250.250.250.250.25
Tstart (C) 60.60.60.70.70.
Tend (C) 200.280.280.230.230.
Heat rate (K/min) 4.4.4.2.2.
Initial hold (min) 1.  2.2.
Final hold (min) 20.  20.
I 949.946.951.955.955.
ReferenceRoyas, Usubillaga, et al., 2004Sadeghpour, Asghari, et al., 2004Sajjadi and Shahpiri, 2004Sawamura, Son, et al., 2004Sawamura, Sou, et al., 2004
Comment MSDC-RI MSDC-RI MSDC-RI MSDC-RI MSDC-RI
Column type CapillaryCapillaryCapillaryCapillaryCapillary
Active phase DB-5DB-1HP-1DB-5HP-5
Column length (m) 30.60.30.30.25.
Carrier gas  HeHeHeN2
Substrate
Column diameter (mm) 0.250.250.250.250.2
Phase thickness (μm) 0.250.250.330.250.5
Tstart (C) 50.40.40.40.30.
Tend (C) 250.280.260.250.280.
Heat rate (K/min) 3.4.2.2.3.
Initial hold (min) 5.5.5.5.
Final hold (min)   20.20.
I 952.953.945.951.954.
ReferenceSefidkon, Jamzad, et al., 2004Sefidkon and Shaabani, 2004Senatore, Napolitano, et al., 2004Senatore, Rigano, et al., 2004Shafi, Nambiar, et al., 2004
Comment MSDC-RI MSDC-RI MSDC-RI MSDC-RI MSDC-RI
Column type CapillaryCapillaryCapillaryCapillaryCapillary
Active phase HP-5DB-5CP Sil 5 CBBPX-5CP Sil 8 CB
Column length (m) 25.30.20.25.30.
Carrier gas H2HeHeHeHe
Substrate
Column diameter (mm) 0.320.250.250.220.25
Phase thickness (μm) 0.520.250.251.0.25
Tstart (C) 40.60.100.60.50.
Tend (C) 240.240.270.250.200.
Heat rate (K/min) 4.3.8.3.10.
Initial hold (min)   2.5.3.
Final hold (min)    10.2.
I 953.950.940.957.950.
ReferenceSimic, Sokovic, et al., 2004Tellez, Khan, et al., 2004Thappa, Bakshi, et al., 2004Vilaseca, Guy, et al., 2004Wang and Guo-Y. -L., 2004
Comment MSDC-RI MSDC-RI MSDC-RI MSDC-RI MSDC-RI
Column type CapillaryCapillaryCapillaryCapillaryCapillary
Active phase CP Sil 8 CBDB-5HP-5MSDB-5DB-1
Column length (m) 30.30.30.30.60.
Carrier gas  HeHeHeHe
Substrate
Column diameter (mm) 0.320.2490.250.250.25
Phase thickness (μm) 0.250.250.250.250.25
Tstart (C) 50.60.60.60.70.
Tend (C) 200.300.275.240.230.
Heat rate (K/min) 5.3.4.4.2.
Initial hold (min) 5.   2.
Final hold (min)     20.
I 953.946.952.953.955.
ReferenceWang, Guo, et al., 2004Woerdenbag, Windono, et al., 2004Afsharypuor and Jahromy, 2003Cabanillas, Lopez, et al., 2003Choi, 2003
Comment MSDC-RI MSDC-RI MSDC-RI MSDC-RI MSDC-RI
Column type CapillaryCapillaryCapillaryCapillaryCapillary
Active phase HP-5MSRTX-5SilHP-1DB-1HP-5MS
Column length (m) 30.30.30.30.30.
Carrier gas HeHeHeN2He
Substrate
Column diameter (mm) 0.250.250.250.250.25
Phase thickness (μm) 0.250.250.250.250.25
Tstart (C) 60.70.70.50.60.
Tend (C) 280.200.200.200.275.
Heat rate (K/min) 3.4.10.5.4.
Initial hold (min)
Final hold (min)  10.
I 949.950.944.933.951.
ReferenceCouladis, Özcan, et al., 2003Dudai, Larkov, et al., 2003Fekam Boyom, Amvam Zollo, et al., 2003Fekam Boyom, Ngouana, et al., 2003Ghannadi, Aghazari, et al., 2003
Comment MSDC-RI MSDC-RI MSDC-RI MSDC-RI MSDC-RI
Column type CapillaryCapillaryCapillaryCapillaryCapillary
Active phase HP-5MSRSL-200RSL-200CP Sil 5 CBDB-5MS
Column length (m) 30.30.30.25.30.
Carrier gas HeH2H2HeHe
Substrate
Column diameter (mm) 0.250.320.320.250.25
Phase thickness (μm) 0.250.250.250.250.25
Tstart (C) 60.40.40.35.60.
Tend (C) 275.280.280.280.240.
Heat rate (K/min) 4.6.6.5.3.
Initial hold (min)  5.5.2.5
Final hold (min)  5.5.
I 950.939.950.940.948.
ReferenceHajhashemi, Ghannadi, et al., 2003Jirovetz, Buchbauer, et al., 2003Jirovetz, Buchbauer, et al., 2003, 2Kanjilal, Kotoky, et al., 2003Maia, Taveira, et al., 2003
Comment MSDC-RI MSDC-RI MSDC-RI MSDC-RI MSDC-RI
Column type CapillaryCapillaryCapillaryCapillaryCapillary
Active phase DB-5ZB-1DB-1HP-5OV-101
Column length (m) 30.30.60.30.50.
Carrier gas HeN2HeHeliumHe
Substrate
Column diameter (mm) 0.250.250.250.320.2
Phase thickness (μm) 0.250.250.25 0.5
Tstart (C) 60.45.50.70.50.
Tend (C) 280.230.270.210.250.
Heat rate (K/min) 3.3.4.2.2.
Initial hold (min)
Final hold (min) 30.  60.
I 948.942.952.951.940.
ReferenceMarongiu, Porcedda, et al., 2003Mierendorff, Stahl-Biskup, et al., 2003Mirza, Nik, et al., 2003Mookdasanit, Tamura, et al., 2003Orav, Kailas, et al., 2003
Comment MSDC-RI MSDC-RI MSDC-RI MSDC-RI MSDC-RI
Column type CapillaryCapillaryCapillaryCapillaryCapillary
Active phase DB-1DB-5HP-5DB-1DB-5
Column length (m) 50.30.30.60.30.
Carrier gas N2H2HeHeHe
Substrate
Column diameter (mm) 0.250.250.250.250.2
Phase thickness (μm) 0.250.250.250.250.25
Tstart (C) 95.60.60.50.75.
Tend (C) 240.280.280.250.220.
Heat rate (K/min) 4.4.3.4.3.
Initial hold (min)  10.  4.
Final hold (min)  40.
I 957.953.934.953.954.
ReferencePerez-Alonso, Velasco-Negueruela, et al., 2003Pino, Marbot, et al., 2003Pitarokili, Tzakou, et al., 2003Pourmortazavi, Sefidkon, et al., 2003Priestap, van Baren, et al., 2003
Comment MSDC-RI MSDC-RI MSDC-RI MSDC-RI MSDC-RI
Column type CapillaryCapillaryCapillaryCapillaryCapillary
Active phase DB-1DB-1HP-5MSHP-5DB-5
Column length (m) 60.60.30.30.30.
Carrier gas HeHeHeHeHe
Substrate
Column diameter (mm) 0.250.250.250.250.25
Phase thickness (μm) 0.250.250.250.250.25
Tstart (C) 40.40.60.60.60.
Tend (C) 220.220.275.280.240.
Heat rate (K/min) 4.4.4.4.3.
Initial hold (min)
Final hold (min)
I 943.943.951.951.950.
ReferenceRasooli and Mirmostafa, 2003Rasooli and Mirmostafa, 2003Sadraei, Ghannadi, et al., 2003Sajjadi and Mehregan, 2003da Silva, Luz, et al., 2003
Comment MSDC-RI MSDC-RI MSDC-RI MSDC-RI MSDC-RI
Column type CapillaryCapillaryCapillaryCapillaryCapillary
Active phase HP-5DB-1DB-1Cross-Linked MethylsiliconeHP-5
Column length (m) 60.60.50.25.25.
Carrier gas  N2N2HeH2
Substrate
Column diameter (mm) 0.250.250.250.20.32
Phase thickness (μm) 0.250.250.250.330.53
Tstart (C) 40.70.90.70.40.
Tend (C) 250.230.240.250.280.
Heat rate (K/min) 5.2.4.4.4.
Initial hold (min) 15.2.
Final hold (min)  20.
I 949.958.924.938.950.
ReferenceStashenko, Jaramillo, et al., 2003Tu, Onishi, et al., 2003Velasco-Negueruela, Pérez-Alonso, et al., 2003Velasco-Negueruela, Pérez-Alonso, et al., 2003, 2Velickovic, Randjelovic, et al., 2003
Comment MSDC-RI MSDC-RI MSDC-RI MSDC-RI MSDC-RI
Column type CapillaryCapillaryCapillaryCapillaryCapillary
Active phase HP-5HP-5HP-5HP-5DB-5
Column length (m) 25.25.25.30.30.
Carrier gas H2HeliumHeliumHeHe
Substrate
Column diameter (mm) 0.320.320.320.250.25
Phase thickness (μm) 0.530.530.530.320.25
Tstart (C) 40.40.40.60.60.
Tend (C) 280.280.280.250.240.
Heat rate (K/min) 4.4.4.5.3.
Initial hold (min)    30.
Final hold (min)
I 954.942.954.959.952.
ReferenceVelickovic, Randjelovic, et al., 2003Velickovic, Ristic, et al., 2003Velickovic, Ristic, et al., 2003Yassa, Akhani, et al., 2003Zoghbi, Andrade, et al., 2003
Comment MSDC-RI MSDC-RI MSDC-RI MSDC-RI MSDC-RI
Column type CapillaryCapillaryCapillaryCapillaryCapillary
Active phase DB-5DB-5OV-101DB-5HP-1
Column length (m) 25.30.25.30.30.
Carrier gas N2He HeHe
Substrate
Column diameter (mm) 0.250.2490.320.250.25
Phase thickness (μm) 0.250.25 0.250.25
Tstart (C) 50.60.50.60.70.
Tend (C) 250.300.200.280.220.
Heat rate (K/min) 4.3.5.3.3.
Initial hold (min)
Final hold (min) 10.5. 30.15.
I 952.946.944.947.942.
ReferenceZrira, Elamrani, et al., 2003Bos, Koulman, et al., 2002Boyom, Keumedjio, et al., 2002Caredda, Marongiu, et al., 2002Cavaleiro, Salgueiro, et al., 2002
Comment MSDC-RI MSDC-RI MSDC-RI MSDC-RI MSDC-RI
Column type CapillaryCapillaryCapillaryCapillaryCapillary
Active phase 5 % Phenyl methyl siloxaneDB-1DB-5MSDB-5MSBP-1
Column length (m) 30.60.30.30.25.
Carrier gas HeHeHeHeN2
Substrate
Column diameter (mm) 0.250.320.250.250.50
Phase thickness (μm) 0.250.250.25 0.25
Tstart (C) 75.50.60.50.60.
Tend (C) 200.200.280.280.220.
Heat rate (K/min) 3.3.3.15.5.
Initial hold (min) 4.6. 2.
Final hold (min) 8.  10.10.
I 954.963.961.946.946.
ReferenceCicció and Gómez-Laurito, 2002Cimanga, Apers, et al., 2002Congiu, Falconieri, et al., 2002Damon, Hernández, et al., 2002Das, Ram, et al., 2002
Comment MSDC-RI MSDC-RI MSDC-RI MSDC-RI MSDC-RI
Column type CapillaryCapillaryCapillaryCapillaryCapillary
Active phase DB-5DB-1HP-5SE-30HP-5
Column length (m) 30.30.30.50.30.
Carrier gas N2H2HeHe
Substrate
Column diameter (mm) 0.250.320.250.250.25
Phase thickness (μm) 0.250.250.250.25
Tstart (C) 50.40.60.70.50.
Tend (C) 250.245.275.240.200.
Heat rate (K/min) 4.3.4.4.3.
Initial hold (min)  20.
Final hold (min)
I 953.931.946.957.954.
ReferenceFarah, Fechtal, et al., 2002Gancel, Ollé, et al., 2002Ghannadi, Sajjadi, et al., 2002Iñigo, Palá-Paúl, et al., 2002Isidorov and Jdanova, 2002
Comment MSDC-RI MSDC-RI MSDC-RI MSDC-RI MSDC-RI
Column type CapillaryCapillaryCapillaryCapillaryCapillary
Active phase RSL-200SPB-5DB-5DB-5DB-5
Column length (m) 30.60.30.30.30.
Carrier gas H2HeHeHeHe
Substrate
Column diameter (mm) 0.320.250.250.250.25
Phase thickness (μm) 0.250.250.250.250.25
Tstart (C) 40.50.60.35.35.
Tend (C) 280.240.240.280.280.
Heat rate (K/min) 6.5.3.3.4.
Initial hold (min) 5.3. 2.2.
Final hold (min) 5.10. 15.15.
I 955.961.952.946.946.
ReferenceJirovetz, Buchbauer, et al., 2002Kim and Lee, 2002Kobaisy, Tellez, et al., 2002Krauze-Baranowska, Mardarowicz, et al., 2002Krauze-Baranowska, Mardarowicz, et al., 2002, 2
Comment MSDC-RI MSDC-RI MSDC-RI MSDC-RI MSDC-RI
Column type CapillaryCapillaryCapillaryCapillaryCapillary
Active phase OV-101OV-101DB-1DB-1SPB-5
Column length (m) 25.25.30.50.30.
Carrier gas HeHeHeN2Helium
Substrate
Column diameter (mm) 0.320.320.250.250.25
Phase thickness (μm)   0.250.250.25
Tstart (C) 50.50.60.80.60.
Tend (C) 200.200.250.225.250.
Heat rate (K/min) 5.5.4.4.4.
Initial hold (min)   10. 2.
Final hold (min)     20.
I 944.945.944.941.953.
ReferenceKuiate, Bessière, et al., 2002Menut, Bessière, et al., 2002Norouzi-Arasi, Yavari, et al., 2002Palá-Paúl, Pérez-Alonso, et al., 2002Pino, Marbot, et al., 2002
Comment MSDC-RI MSDC-RI MSDC-RI MSDC-RI MSDC-RI
Column type CapillaryCapillaryCapillaryCapillaryCapillary
Active phase HP-1DB-1DB-1RTX-5DB-1
Column length (m) 50.60.60.20.50.
Carrier gas N2HeHeHeN2
Substrate
Column diameter (mm) 0.250.250.250.180.25
Phase thickness (μm) 0.250.250.250.40.25
Tstart (C) 90.40.40.20.60.
Tend (C) 220.280.280.290.240.
Heat rate (K/min) 3.4.4.40.3.
Initial hold (min)  5.5.3.5
Final hold (min)    0.5
I 942.954.953.949.937.
ReferencePriestap, van Baren, et al., 2002Sefidkon, Jalili, et al., 2002Sefidkon, 2002Sies A., Hirsch R., et al., 2002Velasco-Negueruela, Pérez-Alonso, et al., 2002
Comment MSDC-RI MSDC-RI MSDC-RI MSDC-RI MSDC-RI
Column type CapillaryCapillaryCapillaryCapillaryCapillary
Active phase HP-5DB-1DB-5MSDB-5SPB-5
Column length (m) 30.60.30.30.60.
Carrier gas H2HeHeHeHe
Substrate
Column diameter (mm) 0.250.250.250.250.32
Phase thickness (μm) 0.250.250.250.25
Tstart (C) 40.50.60.60.40.
Tend (C) 280.250.270.240.220.
Heat rate (K/min) 4.4.3.3.3.
Initial hold (min)  5.  5.
Final hold (min)     15.
I 953.952.948.955.951.
ReferenceVelickovic, Randjelovic, et al., 2002Yamini, Sefidkon, et al., 2002Zoghbi, Andrade, et al., 2002Zoghbi, Andrade, et al., 2002, 2Cornu, Carnat, et al., 2001
Comment MSDC-RI MSDC-RI MSDC-RI MSDC-RI MSDC-RI
Column type CapillaryCapillaryCapillaryCapillaryCapillary
Active phase DB-1DB-1HP-5Optima-5RTX-1
Column length (m) 60.60.30.30.30.
Carrier gas HeHeN2HeN2
Substrate
Column diameter (mm) 0.250.250.250.20.25
Phase thickness (μm) 0.250.250.25 0.25
Tstart (C) 40.40.60.50.60.
Tend (C) 280.280.220.250.300.
Heat rate (K/min) 4.4.5.3.4.
Initial hold (min) 5.5.10.3.
Final hold (min)
I 936.940.955.943.945.
ReferenceDabiri and Sefidkon, 2001Dabiri and Sefidkon, 2001Gallori, Flamini, et al., 2001Jacquemond-Collet, Bessière, et al., 2001Kalemba, Marschall, et al., 2001
Comment MSDC-RI MSDC-RI MSDC-RI MSDC-RI MSDC-RI
Column type CapillaryCapillaryCapillaryCapillaryCapillary
Active phase SPB-1SPB-5CBP-1DB-1DB-1
Column length (m) 30.60.25.60.30.
Carrier gas N2HeliumNitrogenHeN2
Substrate
Column diameter (mm) 0.250.250.250.250.25
Phase thickness (μm) 0.250.250.250.250.25
Tstart (C) 70.50.50.50.80.
Tend (C) 180.240.210.270.225.
Heat rate (K/min) 2.3.3.4.4.
Initial hold (min) 2.3.2.
Final hold (min) 1.10.
I 942.959.941.952.938.
ReferenceKamath, Asha, et al., 2001Kim and Lee, 2001Ly, Yamauchi, et al., 2001Mirza, Ahmadi, et al., 2001Palá-Paúl, Pérez-Alonso, et al., 2001
Comment MSDC-RI MSDC-RI MSDC-RI MSDC-RI MSDC-RI
Column type CapillaryCapillaryCapillaryCapillaryCapillary
Active phase DB-5DB-5DB-1CP Sil 5 CBCP-Sil 5 CB
Column length (m) 60.30.30.25.25.
Carrier gas HeH2HeHeNitrogen
Substrate
Column diameter (mm) 0.250.250.20.250.25
Phase thickness (μm)  0.25 0.390.39
Tstart (C) 50.60.60.60.60.
Tend (C) 250.285.240.220.220.
Heat rate (K/min) 3.3.3.5.5.
Initial hold (min) 5.
Final hold (min)
I 953.946.946.0949.949.
ReferenceRousis, Papadogianni, et al., 2001Santos-Gomes and Fernandes-Ferreira, 2001Santos, Moreira, et al., 2001Sayyah, Kamalinejad, et al., 2001Sayyah, Kamalinejad, et al., 2001, 2
Comment MSDC-RI MSDC-RI MSDC-RI MSDC-RI MSDC-RI
Column type CapillaryCapillaryCapillaryCapillaryCapillary
Active phase HP-5 MSDB-5OV-101OV-101SPB-1
Column length (m) 30.30.50.50.30.
Carrier gas HeliumHeN2N2He
Substrate
Column diameter (mm) 0.250.250.250.250.2
Phase thickness (μm) 0.250.25  0.2
Tstart (C) 50.60.80.80.80.
Tend (C) 250.240.200.200.300.
Heat rate (K/min) 5.3.2.2.5.
Initial hold (min) 2.   3.
Final hold (min) 5.
I 955.954.953.953.954.
ReferenceShang, Hu, et al., 2001Tellez M., Estell R., et al., 2001Yang, 2001Yang, 2001, 2Fraternale, Giamperi, et al., 2000
Comment MSDC-RI MSDC-RI MSDC-RI MSDC-RI MSDC-RI
Column type CapillaryCapillaryCapillaryCapillaryCapillary
Active phase RSL-200SPB-5DB-1DB-5BP-1
Column length (m) 60.60.25.30.25.
Carrier gas H2HeNitrogenN2N2
Substrate
Column diameter (mm) 0.320.250.500.220.33
Phase thickness (μm) 0.250.250.250.251.0
Tstart (C) 40.70.60.70.60.
Tend (C) 250.240.220.230.275.
Heat rate (K/min) 6.5.5.4.4.
Initial hold (min)  8. 2.
Final hold (min)  20. 20.
I 954.958.947.951.952.
ReferenceJirovetz, Puschmann, et al., 2000Kim, Kim, et al., 2000Mallavarapu, Rao, et al., 2000Mitiku, Sawamura, et al., 2000Mohagheghzadeh, Shams-Ardakani, et al., 2000
Comment MSDC-RI MSDC-RI MSDC-RI MSDC-RI MSDC-RI
Column type CapillaryCapillaryCapillaryCapillaryCapillary
Active phase HP-5OV-101DB-5SE-30Methyl Silicone
Column length (m) 30.50.30.25.60.
Carrier gas HeNitrogenHeHe
Substrate
Column diameter (mm) 0.250.250.250.20.25
Phase thickness (μm) 0.25 0.25 0.25
Tstart (C) 60.40.60.60.40.
Tend (C) 275.200.240.230.220.
Heat rate (K/min) 4.2.3.3.5.
Initial hold (min)  10.  10.
Final hold (min)
I 951.952.954.941.943.70
ReferenceMohagheghzadeh, Shams-Ardakani, et al., 2000, 2Tamura, Boonbumrung, et al., 2000Tellez, Dayan, et al., 2000Ali N.A.M. and Jantan, 1999Baraldi, Rapparini, et al., 1999
Comment MSDC-RI MSDC-RI MSDC-RI MSDC-RI MSDC-RI
Column type CapillaryCapillaryCapillaryCapillaryCapillary
Active phase OV-1SPB-1OV-101SE-30RTX-1
Column length (m) 25.50.52.30.30.
Carrier gas Hydrogen HeliumN2N2
Substrate
Column diameter (mm) 0.320.20.260.250.25
Phase thickness (μm) 0.300.330.130.250.25
Tstart (C) 50.60.50.60.60.
Tend (C) 200.260.220.220.300.
Heat rate (K/min) 3.4.3.4.4.
Initial hold (min) 1. 0.10.
Final hold (min) 10. 0.
I 933.943.943.945.948.
ReferenceBicchi, Binello, et al., 1999Choo, Wong, et al., 1999Dzumayev, Tkachenko, et al., 1999Jassbi, Ahmad, et al., 1999Kalemba, 1999
Comment MSDC-RI MSDC-RI MSDC-RI MSDC-RI MSDC-RI
Column type CapillaryCapillaryCapillaryCapillaryCapillary
Active phase DB-1DB-5SE-30DB-1OV-1
Column length (m) 25.30.25.30.25.
Carrier gas He HeHeH2
Substrate
Column diameter (mm) 0.250.320.20.250.25
Phase thickness (μm) 0.251. 0.250.25
Tstart (C) 50.40.60.50.40.
Tend (C) 290.200.230.200.220.
Heat rate (K/min) 4.3.3.4.3.
Initial hold (min)  5.10. 5.
Final hold (min)     5.
I 946.948.941.948.941.
ReferenceKoulman, 1999Meynier, Novelli, et al., 1999Mohd and Jantan, 1999Nori-Shargh, Norouzi-Arasi, et al., 1999Oberhofer, Nikiforov, et al., 1999
Comment MSDC-RI MSDC-RI MSDC-RI MSDC-RI MSDC-RI
Column type CapillaryCapillaryCapillaryCapillaryCapillary
Active phase CP Sil 5 CBDB-1OV-101SE-30Ultra-2
Column length (m) 25.50.50.30.25.
Carrier gas HeHeHeHelium
Substrate
Column diameter (mm) 0.250.250.250.250.2
Phase thickness (μm)  0.250.250.20
Tstart (C) 50.70.70.60.40.
Tend (C) 230.240.220.200.300.
Heat rate (K/min) 3.4.2.3.5.
Initial hold (min)   5.4.4.
Final hold (min)
I 946.938.936.943.949.
ReferenceOyedeji, Olawore, et al., 1999Palá-Paúl, Pérez-Alonso, et al., 1999Pateira, Nogueira, et al., 1999Prikhod'ko, Klyuev, et al., 1999Quiroz, Fuentes-Contreras, et al., 1999
Comment MSDC-RI MSDC-RI MSDC-RI MSDC-RI MSDC-RI
Column type CapillaryCapillaryCapillaryCapillaryCapillary
Active phase BP-1CP Sil 5 CBDB-1DB-5DB-1
Column length (m) 25.25.60.30.60.
Carrier gas N2HeHeHeHe
Substrate
Column diameter (mm) 0.50.250.250.250.32
Phase thickness (μm)  0.390.250.25
Tstart (C) 60.60.40.40.60.
Tend (C) 220.220.280.220.230.
Heat rate (K/min) 5.5.4.4.3.
Initial hold (min)  5.5.5.
Final hold (min) 10.20.  5.
I 947.948.945.947.950.
ReferenceRao, Bhattacharya, et al., 1999Rustaiyan, Masoudi, et al., 1999Sefidkon, Dabiri, et al., 1999Sefidkon and Khajavi, 1999Shafiee, Javidnia, et al., 1999
Comment MSDC-RI MSDC-RI MSDC-RI MSDC-RI MSDC-RI
Column type CapillaryCapillaryCapillaryCapillaryCapillary
Active phase DB-5SPB-5CP Sil 5 CBOV-101DB-5MS
Column length (m) 30.60.25.25.30.
Carrier gas HeHeN2HeHe
Substrate
Column diameter (mm) 0.250.32 0.200.25
Phase thickness (μm) 0.251.0.39 0.25
Tstart (C) 60.40.60.80.60.
Tend (C) 240.200.220.240.240.
Heat rate (K/min) 3.3.5.6.3.
Initial hold (min)  5.
Final hold (min)  2.
I 954.959.951.946.949.
ReferenceTellez, Canel, et al., 1999Viallon C., Verdier-Metz I., et al., 1999Weyerstahl, Marschall, et al., 1999Zenkevich, Kosman, et al., 1999Zoghbi, Andrade, et al., 1999
Comment MSDC-RI MSDC-RI MSDC-RI MSDC-RI MSDC-RI
Column type CapillaryCapillaryCapillaryCapillaryCapillary
Active phase SPB-5DB-5SE-30DB-5HP-5
Column length (m) 50.30.25.30.25.
Carrier gas HeHeHeHeHe
Substrate
Column diameter (mm) 0.320.250.20.250.2
Phase thickness (μm) 0.250.25 0.250.33
Tstart (C) 60.60.60.60.70.
Tend (C) 240.240.180.240.290.
Heat rate (K/min) 3.3.3.3.3.
Initial hold (min)   10. 8.
Final hold (min) 20.   20.
I 951.945.947.949.954.
ReferenceDoneanu and Anitescu, 1998El-Sakhawy, El-Tantawy, et al., 1998Jantan, Ahmad, et al., 1998Maia, Zohhbi, et al., 1998Poiana, Sicari, et al., 1998
Comment MSDC-RI MSDC-RI MSDC-RI MSDC-RI MSDC-RI
Column type CapillaryCapillaryCapillaryCapillaryCapillary
Active phase HP-1OV-101CP Sil 5 CBCP Sil 5 CBCP Sil 5 CB
Column length (m) 60.25.25.25.25.
Carrier gas He N2N2He
Substrate
Column diameter (mm) 0.250.320.320.320.25
Phase thickness (μm) 0.25 0.250.250.25
Tstart (C) 50.50.50.50.60.
Tend (C) 280.200.290.290.300.
Heat rate (K/min) 4.5.4.4.6.
Initial hold (min) 5.
Final hold (min)
I 970.944.937.937.937.
ReferenceStashenko, Cervantes, et al., 1998Zollo, Biyiti, et al., 1998Bos, Woerdenbag, et al., 1997Bos, Woerdenbag, et al., 1997Bos, Woerdenbag, et al., 1997, 2
Comment MSDC-RI MSDC-RI MSDC-RI MSDC-RI MSDC-RI
Column type CapillaryCapillaryCapillaryCapillaryCapillary
Active phase SPB-SulfurSPB-SulfurDB-1DB-5DB-5
Column length (m) 30.30. 30.30.
Carrier gas HeHe HeliumHe
Substrate
Column diameter (mm) 0.320.32 0.250.25
Phase thickness (μm) 4.4. 0.25
Tstart (C) 45.45.80.60.60.
Tend (C) 240.240.220.240.240.
Heat rate (K/min) 5.5.6.3.4.
Initial hold (min) 13.13.
Final hold (min) 5.5.
I 964.964.938.954.953.
ReferenceMariaca, Berger, et al., 1997Mariaca, Berger, et al., 1997Salgueiro, Vila, et al., 1997Tellez, Estell, et al., 1997Zunino, Novillo-Newton, et al., 1997
Comment MSDC-RI MSDC-RI MSDC-RI MSDC-RI MSDC-RI
Column type CapillaryCapillaryCapillaryCapillaryCapillary
Active phase HP-1OV-101OV-101HP-1HP-5
Column length (m) 23.50.50.25.
Carrier gas HeN2HeHelium
Substrate
Column diameter (mm) 0.320.250.250.32
Phase thickness (μm) 0.170.17 0.25
Tstart (C) 60.50.50.60.35.
Tend (C) 250.220.250.220.200.
Heat rate (K/min) 5.5.2.4.6.
Initial hold (min) 3.  2.2.
Final hold (min) 30.  20.
I 940.950.941.940.966.
ReferenceAyedoun, Adeoti, et al., 1996Chacko, Jayalekshmy, et al., 1996Orav, Kailas, et al., 1996Thanh, Dung, et al., 1996Larsen and Frisvad, 1995
Comment MSDC-RI MSDC-RI MSDC-RI MSDC-RI MSDC-RI
Column type CapillaryCapillaryCapillaryCapillaryCapillary
Active phase OV-101DB-1DB-1DB-1HP-5
Column length (m) 50.60.60.60.
Carrier gas HeHeHeHe
Substrate
Column diameter (mm) 0.20.250.250.25
Phase thickness (μm) 0.50.250.250.25
Tstart (C) 70.50.70.70.35.
Tend (C) 180.250.270.270.200.
Heat rate (K/min) 1.3.52.52.56.
Initial hold (min)  5.5.5.2.
Final hold (min)
I 943.942.962.962.966.
ReferenceOrav, Kuningas, et al., 1995Stashenko, Torres, et al., 1995Tirado, Stashenko, et al., 1995Tirado, Stashenko, et al., 1995Larsen and Frisvad, 1994
Comment MSDC-RI MSDC-RI MSDC-RI MSDC-RI MSDC-RI
Column type CapillaryCapillaryCapillaryCapillaryCapillary
Active phase OV-1HP-5HP-5Methyl SiliconeMethyl Silicone
Column length (m) 50.  50.50.
Carrier gas N2  N2N2
Substrate
Column diameter (mm) 0.27  0.250.25
Phase thickness (μm) 0.2  0.170.17
Tstart (C) 80.40.40.80.80.
Tend (C) 240.210.210.200.200.
Heat rate (K/min) 3.2.2.2.3.
Initial hold (min)
Final hold (min)
I 948.951.952.954.954.
ReferenceRamanoelina, Viano, et al., 1994Collin, Deslauriers, et al., 1993Collin, Deslauriers, et al., 1993Gopalakrishnan, Menon, et al., 1993Gopalakrishnan, Menon, et al., 1993
Comment MSDC-RI MSDC-RI MSDC-RI MSDC-RI MSDC-RI
Column type CapillaryCapillaryCapillaryCapillaryCapillary
Active phase CP Sil 5 CBMethyl SiliconeDB-1SPB-5SE-54
Column length (m) 25.25.60.30.30.
Carrier gas   He Hydrogen
Substrate
Column diameter (mm) 0.250.500.32 0.25
Phase thickness (μm)   1.21.00.25
Tstart (C) 60.60.30.50.60.
Tend (C) 280.220.240.250.250.
Heat rate (K/min) 5.5.3.8.2.
Initial hold (min)   10. 5.
Final hold (min)     2.
I 949.951.948.948.947.
ReferenceKaul, Singh, et al., 1993Mallavarapu, Ramesh, et al., 1993Ciccioli, Cecinato, et al., 1992King and Knight, 1992Kollmannsberger, Nitz, et al., 1992
Comment MSDC-RI MSDC-RI MSDC-RI MSDC-RI MSDC-RI
Column type CapillaryCapillaryCapillaryCapillaryCapillary
Active phase DB-1RSL-150BP-1OV-101OV-101
Column length (m) 30.30.25.50.50.
Carrier gas N2  N2N2
Substrate
Column diameter (mm)  0.320.330.250.25
Phase thickness (μm)  0.20
Tstart (C) 80.30.45.80.80.
Tend (C) 220.200.180.200.200.
Heat rate (K/min) 4.3.3.2.2.
Initial hold (min)   3.
Final hold (min)
I 943.942.946.952.954.
ReferenceVelasco-Negueruela, Pérez Alonso, et al., 1991Ronse and De Pooter, 1990Wyllie, Brophy, et al., 1990Yang and Sugisawa, 1990Yang and Sugisawa, 1990
Comment MSDC-RI MSDC-RI MSDC-RI MSDC-RI MSDC-RI
Column type CapillaryCapillaryCapillaryCapillaryCapillary
Active phase BP-1SE-30OV-101OV-101OV-1
Column length (m) 50.40.50.50.60.
Carrier gas H2HeN2N2Helium
Substrate
Column diameter (mm) 0.300.500.250.250.50
Phase thickness (μm)  0.75  1.2
Tstart (C) 40.30.80.80.40.
Tend (C) 250.220.200.200.220.
Heat rate (K/min) 10.3.2.2.2.
Initial hold (min) 1.
Final hold (min)
I 943.939.947.954.940.
ReferenceBrophy, Davies, et al., 1989de Pooter, de Buyck, et al., 1989Sugisawa, Yang, et al., 1989Sugisawa, Yang, et al., 1989Wahab, Aboutabl, et al., 1987
Comment MSDC-RI MSDC-RI MSDC-RI MSDC-RI MSDC-RI
Column type CapillaryCapillaryCapillaryCapillaryCapillary
Active phase DB-1OV-1OV-101SE-30SE-30+Igepal
Column length (m) 10. 50.50.100.
Carrier gas H2HeHeHe
Substrate
Column diameter (mm) 0.25 0.310.50.25
Phase thickness (μm) 0.25
Tstart (C) 50.40.0.40.70.
Tend (C) 250.220.225.170.170.
Heat rate (K/min) 5.2.3.3.1.
Initial hold (min)   1.3.
Final hold (min)
I 945.940.934.943.948.
ReferencePerry, Baxter, et al., 1986De Pooter, De Buyck, et al., 1986del Rosario, de Lumen, et al., 1984Heydanek and McGorrin, 1981Shibamoto and Jennings, 1977
Comment MSDC-RI MSDC-RI MSDC-RI MSDC-RI MSDC-RI
Column type CapillaryCapillary
Active phase SE-30+IgepalSF-96
Column length (m) 100.111.
Carrier gas  Nitrogen
Substrate
Column diameter (mm) 0.250.76
Phase thickness (μm)
Tstart (C) 70.
Tend (C) 170.130.
Heat rate (K/min) 1.3.
Initial hold (min)  8.
Final hold (min)  40.
I 952.941.
ReferenceShibamoto and Jennings, 1977Donetzhuber, Johansson, et al., 1976
Comment MSDC-RI MSDC-RI

Normal alkane RI, polar column, custom temperature program

Data compiled by: NIST Mass Spectrometry Data Center, William E. Wallace, director

Column type CapillaryCapillaryCapillaryCapillaryCapillary
Active phase DB-WaxInnowaxDB-WaxDB-WaxHP-Innowax
Column length (m) 60.30.30.30.60.
Carrier gas HeliumHeliumHeliumHeliumHelium
Substrate
Column diameter (mm) 0.200.250.250.250.25
Phase thickness (μm) 0.250.250.250.250.25
Program 40 0C (3 min) 2 0C/min -> 150 0C 4 0C/min -> 220 0C (20 min) 5 0C/min -> 230 0Cnot specifiednot specifiednot specifiednot specified
I 1060.1075.1075.1077.1076.
ReferenceGyawali and Kim, 2012Siristova, Prinosilova, et al., 2012Welke, Manfroi, et al., 2012Welke, Manfroi, et al., 2012Feng, Cui, et al., 2011
Comment MSDC-RI MSDC-RI MSDC-RI MSDC-RI MSDC-RI
Column type CapillaryCapillaryCapillaryCapillaryCapillary
Active phase HP InnowaxCP-Wax 52 CBDB-WaxInnowax FSCInnowax FSC
Column length (m) 30. 30.60.60.
Carrier gas Nitrogen HeliumHeliumHelium
Substrate
Column diameter (mm) 0.25 0.250.250.25
Phase thickness (μm) 0.25 0.250.250.25
Program 35 0C (10 min) 3 0C/min -> 205 0C 10 0C/min -> 225 0Cnot specifiednot specified60 0C (10 min) 4 0C/min -> 220 0C (10 min) 1 0C/min -> 240 0C60 0C (10 min) 4 0C/min -> 220 0C (10 min) 1 0C/min -> 240 0C
I 1086.1077.1082.1076.1076.
ReferenceLaribi, Kouki, et al., 2011Povolo, Cabassi, et al., 2011Zeng, Xie, et al., 2011Polatoglu, Demirci, et al., 2010Baser, Demirci, et al., 2009
Comment MSDC-RI MSDC-RI MSDC-RI MSDC-RI MSDC-RI
Column type CapillaryCapillaryCapillaryCapillaryCapillary
Active phase DB-WaxPolyethylene glycol (Free Fatty Acid Phase)Polyethylene glycol (Free Fatty Acid Phase)HP InnowaxHP Innowax FSP
Column length (m) 60.30.30.50.60.
Carrier gas Helium  HeliumHelium
Substrate
Column diameter (mm) 0.250.250.250.200.25
Phase thickness (μm) 0.25  0.250.25
Program 40 0C (3 min) 2 0C/min -> 150 0C 4 0C/min -> 220 0C (20 min)not specifiednot specified40 0C (5 min) 2 0C/min -> 270 0C -> 260 0C (20 min)60 0C (10 min) 4 0C/min -> 220 0C (10 min) 1 0C/min -> 240 0C (20 min)
I 1063.1068.1074.1076.1076.
ReferenceGyawali and Kim, 2009Harraca, Syed, et al., 2009Harraca, Syed, et al., 2009Mancini, Arnold, et al., 2009Wedge, Klun, et al., 2009
Comment MSDC-RI MSDC-RI MSDC-RI MSDC-RI MSDC-RI
Column type CapillaryCapillaryCapillaryCapillaryCapillary
Active phase HP-20MInnowaxDB-WaxSupelcowax-10Supelcowax-10
Column length (m) 25.30.60.30.30.
Carrier gas HeliumHeliumHeliumHeHe
Substrate
Column diameter (mm) 0.200.250.320.250.25
Phase thickness (μm) 0.200.250.250.250.25
Program 30 0C (1 min) 50 0C/min -> 110 0C 1.5 0C/min -> 145 0C 4 0C/min -> 220 0C (10 min)not specifiednot specified35C(8min) => 6C/min => 60C => 4C/min => 160C => 20C/min => 200C(1min)35C(8min) => 6C/min => 60C => 4C/min => 160C => 20C/min => 200C(1min)
I 1075.1071.1048.1053.1060.
ReferenceZellner, Amorim, et al., 2009Aicha, Ines, et al., 2008Beck, Higbee, et al., 2008Berard, Bianchi, et al., 2007Berard, Bianchi, et al., 2007
Comment MSDC-RI MSDC-RI MSDC-RI MSDC-RI MSDC-RI
Column type CapillaryCapillaryCapillaryCapillaryCapillary
Active phase HP-InnowaxInnowax FSCHP-InnowaxHP-InnowaxHP-Innowax
Column length (m) 50.60.30.30.30.
Carrier gas HeNitrogenHeHeHe
Substrate
Column diameter (mm) 0.20.250.250.250.25
Phase thickness (μm) 0.20.250.250.250.25
Program 40C(5min) => 2C/min => 250C(15min) => 10C/min => 270C60 0C (10 min) 1 0C/min -> 220 0C (10 min) 1 0C/min -> 240 0C30C(5min) => 7C/min => 100C(5min) => 1C/min => 130C => 10C/min => 195C(45min)30C(5min) => 7C/min => 100C(5min) => 1C/min => 130C => 10C/min => 195C(45min)30C(5min) => 7C/min => 100C(5min) => 1C/min => 130C => 10C/min => 195C(45min)
I 1076.1076.1049.1050.1049.
ReferenceFormisano, Mignola, et al., 2007Kaya, Benirci, et al., 2007Narain, Galvao, et al., 2007Narain, Galvao, et al., 2007Narain, Galvao, et al., 2007
Comment MSDC-RI MSDC-RI MSDC-RI MSDC-RI MSDC-RI
Column type CapillaryCapillaryCapillaryCapillaryCapillary
Active phase DB-WaxInnowax FSCInnowax FSCHP-Innowax FSCInnowax FSC
Column length (m) 60.60.60.60.60.
Carrier gas HeHeHeHeN2
Substrate
Column diameter (mm) 0.250.250.250.250.25
Phase thickness (μm) 0.250.250.250.250.25
Program 40C(3min) => 2C/min => 150C => 4C/min => 200C (20min)60C(10min) => 4C/min => 220C (10min) => 1C/min => 240C60C(10min) => 4C/min >220C (10min) => 1C/min => 240C60C(10min) => 4C/min => 220C (10min) => 1C/min => 240C60C(10min) => 4C/min => 220C(10min) => 1C/min => 240C
I 1067.1076.1076.1076.1076.
ReferenceSeo, Kim, et al., 2007Tabanca, Demirci, et al., 2007Baser, Özek, et al., 2006Erdurak, Coskun, et al., 2006Iscan, Kirimer, et al., 2006
Comment MSDC-RI MSDC-RI MSDC-RI MSDC-RI MSDC-RI
Column type CapillaryCapillaryCapillaryCapillaryCapillary
Active phase HP-Innowax FSCCarbowax 20MHP-Innowax FSCHP-Innowax FSCHP-Innowax FSC
Column length (m) 60.25.60.60.60.
Carrier gas HeH2He N2
Substrate
Column diameter (mm) 0.250.320.250.250.25
Phase thickness (μm) 0.250.250.250.250.25
Program 60C(10min) => 4C/min => 220C (10min) => 1C/min => 240C40C(8min) => 3C/min => 180C => 20C/min => 230C (10min)60(10min) => 4C/min => 220C(10min) => 1C/min => 240C60C(10min) => 4C/min => 220C (10min) => 1C/min => 240C60C(10min) => 4C/min => 220C => (10min) => 1C/min => 240C
I 1076.1043.1076.1076.1076.
ReferenceKürkçüoglu, Hüsnü Can Baser, et al., 2006Lorenzo, Loayza, et al., 2006Suleimenov Y.M., Atazhanova G.A., et al., 2006Tabanca, Demirci, et al., 2006Tabanca, Demirci, et al., 2006, 2
Comment MSDC-RI MSDC-RI MSDC-RI MSDC-RI MSDC-RI
Column type CapillaryCapillaryCapillaryCapillaryCapillary
Active phase Innowax FSCHP-InnowaxHP-Innowax FSCDB-WaxHP-Innowax FSC
Column length (m) 60.60.60.30.60.
Carrier gas HeN2N2HeHe
Substrate
Column diameter (mm) 0.250.250.250.250.25
Phase thickness (μm) 0.250.250.250.250.25
Program 60C(10min) => 4C/min => 220C (10min) => 1C/min => 240C60C(10min) => 4C/min => 220C (10min) => 1C/min => 240C60C(10min) => 4C/min => 220C (10min) => 1C/min => 240C35C(5min) => 2C/min => 173C(1min) => 15C/min => 210C(5min)60C(10min) => 4C/min => 220C(10min) => 1C/min => 240C
I 1076.1076.1076.1037.1076.
ReferenceTosun, Kürkcüoglu, et al., 2006Demirci, Demirci, et al., 2005Demirci, Demirci, et al., 2005, 2Giuseppe, Manuela, et al., 2005Sezik E., Kocakulak E., et al., 2005
Comment MSDC-RI MSDC-RI MSDC-RI MSDC-RI MSDC-RI
Column type CapillaryCapillaryCapillaryCapillaryCapillary
Active phase HP-Innowax FSCHP-Innowax FSCInnowax FSCHP-Innowax FSCHP-Innowax FSC
Column length (m) 60.60.60.60.60.
Carrier gas HeHeHeHeHe
Substrate
Column diameter (mm) 0.250.250.250.250.25
Phase thickness (μm) 0.250.250.250.250.25
Program 60C(10min) => 4C/min => 220C(10min) => 1C/min => 240C60C(10min) => 4C/min => 220C(10min) => 1C/min => 240C60C(10min) => 4C/min => 220C(10min) => 1C/min => 240C60C(10min) => 4C/min => 220C(10min) => 1C/min => 240C60C(10min) => 4C/min => 220C(10min) => 1C/min => 240C
I 1076.1076.1076.1076.1076.
ReferenceTabanca, Demirci, et al., 2005Viljoen, Subramoney, et al., 2005Baser, Özek, et al., 2004Demirci, Paper, et al., 2004Kivcak, Akay, et al., 2004
Comment MSDC-RI MSDC-RI MSDC-RI MSDC-RI MSDC-RI
Column type CapillaryCapillaryCapillaryCapillaryCapillary
Active phase HP-Innowax FSCHP-InnowaxCarbowax 20MHP-Innowax FSCHP-Innowax FSC
Column length (m) 60.50. 60.60.
Carrier gas He  HeHe
Substrate
Column diameter (mm) 0.250.2 0.250.25
Phase thickness (μm) 0.250.2 0.250.25
Program 60C(10min) => 4C/min => 220C(10min) => 1C/min => 240Cnot specifiednot specified60C (10min) => 4C/min => 220C (10min) => 1C/min => 240C60C(10min) => 4C/min => 220C(10min) => 1C/min => 240C
I 1076.1076.1083.1076.1076.
ReferenceKivcak, Akay, et al., 2004Senatore, Apostolides Arnold, et al., 2004Vinogradov, 2004Demirci, Baser, et al., 2003Demirci, Demirci, et al., 2003
Comment MSDC-RI MSDC-RI MSDC-RI MSDC-RI MSDC-RI
Column type CapillaryCapillaryCapillaryCapillaryCapillary
Active phase HP-Innowax FSCHP-Innowax FSCHP-FFAPHP-InnowaxHP-Innowax
Column length (m) 60.60.30.60.60.
Carrier gas N2HeHe He
Substrate
Column diameter (mm) 0.250.250.250.250.25
Phase thickness (μm) 0.250.25 0.250.25
Program 60C(10min) => 4C/min => 220C(10min) => 1C/min => 240C60C(10min) => 4C/min => 220C(10min) => 1C/min => 240C(40min)60C (2min) => 5C/min => 160C (1min) => 10C/min => 230C (12min)60C(10min) => 4C/min => 220C(10min) => 1C/min => 240C60 0C (10 min) 4 K/min -> 220 0C (10 min) 1 K/min -> 240 0C
I 1076.1076.1097.1076.1076.
ReferenceKaya, Demirci, et al., 2003Kürkcüoglu, Demirci, et al., 2003Mockute and Judzentiene, 2003Viljoen, van Vuuren, et al., 2003Baser, Demirci, et al., 2002
Comment MSDC-RI MSDC-RI MSDC-RI MSDC-RI MSDC-RI
Column type CapillaryCapillaryCapillaryCapillaryCapillary
Active phase Innowax FSCInnowaxHP-InnowaxHP-Innowax FSCSupelcowax-10
Column length (m) 60.60.60.60.60.
Carrier gas HeHeHeN2He
Substrate
Column diameter (mm) 0.250.250.250.250.25
Phase thickness (μm) 0.250.250.250.250.25
Program 60C(10min) => 4C/min => 220C(10min) => 1C/min => 240C60C(10min) => 4C/min => 220C(10min) => 1C/min => 240C60 0C (10 min) 4 K/min -> 220 0C (10 min) 1 K/min -> 240 0C60C(10min) => 4C/min => 220C(10min) => 1C/min => 240C40C (7min) => 4C/min => 150C => 8C/min => 240C (10min)
I 1076.1076.1076.1076.1061.
ReferenceBaser, Demirei, et al., 2002Baser, Nuriddinov, et al., 2002Demirci, Baser, et al., 2002Hüsnü Can Baser, Demirci, et al., 2002Kim and Lee, 2002
Comment MSDC-RI MSDC-RI MSDC-RI MSDC-RI MSDC-RI
Column type CapillaryCapillaryCapillaryCapillaryCapillary
Active phase HP-FFAPInnowax FSCHP-InnowaxHP-InnowaxHP-Innowax FSC
Column length (m) 25.60.60.60.60.
Carrier gas He HeHeHe
Substrate
Column diameter (mm) 0.220.250.250.250.25
Phase thickness (μm)  0.250.250.250.25
Program 60C(2min) => 5C/min => 160C(1min) => 10C/min => 230C(12min)60C(10min) => 4C/min => 220C(10min) => 1C/min => 240C60 0C (10 min) 10 K/min -> 220 0C (10 min) 1K/min -> 240 0C60 0C (10 min) 4 K/min -> 220 0C (10 min) 1 K/min -> 240 0C60C(10min) => 4C/min => 220C(10min) => 1C/min => 240C
I 1097.1076.1076.1076.1076.
ReferenceMockute and Judzentiene, 2002Tunalier, Kirimer, et al., 2002Baser, Demirci, et al., 2001Gören, Demirci, et al., 2001Kirimer N., Tabanea N., et al., 2001
Comment MSDC-RI MSDC-RI MSDC-RI MSDC-RI MSDC-RI
Column type CapillaryCapillaryCapillaryCapillaryCapillary
Active phase Innowax FSCInnowax FSCHP-Innowax FSCHP-InnowaxFFAP
Column length (m) 60.60.60.60.50.
Carrier gas HeHe He
Substrate
Column diameter (mm) 0.250.250.250.250.2
Phase thickness (μm) 0.250.250.250.250.33
Program 60C(10min) => 4C/min => 220C(10min) => 1C/min => 240C60C(10min) => 4C/min => 220C(10min) => 1C/min => 240C60C(10min) => 4C/min => 220C(10min) => 1C/min => 240C60C(10min) => 4C/min => 220C(10min) => 1C/min => 240C60C(1min) => 2.5C/min => 115C => 1C/min => 210C(30min)
I 1076.1076.1076.1076.1056.
ReferenceSaglam, Gozler, et al., 2001Tabanca N., Demirci F., et al., 2001Tabanca, Kirimer, et al., 2001Tabanca, Kirimer, et al., 2001, 2Tucker, Maciarello, et al., 2001
Comment MSDC-RI MSDC-RI MSDC-RI MSDC-RI MSDC-RI
Column type CapillaryCapillaryCapillaryCapillaryCapillary
Active phase HP-WaxInnowaxInnowaxInnowaxRTX-Wax
Column length (m) 60.60.60.60.30.
Carrier gas HeHeHeHeHe
Substrate
Column diameter (mm) 0.250.250.250.250.25
Phase thickness (μm) 0.25 0.250.250.25
Program 50 0C 3 K/min -> 200 0C 8 K/min -> 280 0C60 0C (10 min) 4 K/min -> 220 0C (10 min) 1 K/min -> 240 0C60 0C (10 min) 4 K/min -> 220 0C (10 min) 1 K/min -> 240 0C60 0C (10 min) 4 K/min -> 220 0C (10 min) 1 K/min -> 240 0Cnot specified
I 1069.1076.1076.1076.1040.
ReferenceUsubillaga, Aparicio, et al., 2001Ahmed, Choudhary, et al., 2000Baser, Özek, et al., 2000Baser, Özek, et al., 2000, 2Kéita, Vincent, et al., 2000
Comment MSDC-RI MSDC-RI MSDC-RI MSDC-RI MSDC-RI
Column type CapillaryCapillaryCapillaryCapillaryCapillary
Active phase Innowax FSCSupelcowax-10HP-Innowax FSCInnowax FSCFFAP
Column length (m) 60. 60.60.25.
Carrier gas He HeHeliumH2
Substrate
Column diameter (mm) 0.25 0.250.250.2
Phase thickness (μm) 0.25 0.250.250.33
Program 60C(10 min) => 4C/min => 220C(10min) => 1C/min => 240Cnot specified60C(10min) => 4C/min => 220C(10min) => 1C/min => 240C60 0C (10 min) 4 0C/min -> 220 0C (10 min) 1 0C/min -> 240 0C40C(5min) => 4C/min => 170C => 8C/min => 240C (12min)
I 1076.1063.1076.1076.1049.
ReferenceKirimer, Tabanca, et al., 2000Zunino, Lopez, et al., 2000Bagci, Baser, et al., 1999Kirimer, Tabanca, et al., 1999Reddy, Angers, et al., 1998
Comment MSDC-RI MSDC-RI MSDC-RI MSDC-RI MSDC-RI
Column type CapillaryCapillaryCapillaryCapillaryCapillary
Active phase Carbowax 20MDB-WaxCarbowax 20MNB-351NB-351
Column length (m)  60.60.25.25.
Carrier gas  N2He He
Substrate
Column diameter (mm)   0.250.320.32
Phase thickness (μm)  0.250.250.20.2
Program not specifiednot specifiednot specified40C(5min) => 4C/min => 170C => 8C/min => 240C (12min)35C(5min) => 2.5C/min => 150C => 5C/min => 240C (20min)
I 1057.1079.1083.1046.1043.
ReferenceVernin, Lageot, et al., 1998Weyerstahl, Marschall, et al., 1998Tirado, Stashenko, et al., 1995Kerrola, Galambosi, et al., 1994Kerrola and Kallio, 1994
Comment MSDC-RI MSDC-RI MSDC-RI MSDC-RI MSDC-RI
Column type CapillaryCapillaryCapillaryCapillary
Active phase NB-351CP-Wax 52CBCarbowax 20MPolyethylene Glycol
Column length (m) 25.50.
Carrier gas
Substrate
Column diameter (mm) 0.320.32
Phase thickness (μm) 0.2
Program 40C(5min) => 4C/min => 150C => 8C/min => 240C(12min)not specifiednot specifiednot specified
I 1051.1063.1083.1083.
ReferenceKerrola and Kallio, 1993Vernin, 1991Shibamoto, 1987MacLeod and Pieris, 1981
Comment MSDC-RI MSDC-RI MSDC-RI MSDC-RI

Kovats' RI, non-polar column, temperature ramp

Data compiled by: NIST Mass Spectrometry Data Center, William E. Wallace, director

Column type CapillaryCapillaryCapillaryCapillaryCapillary
Active phase HP-5MSDB-5DB-1DB-5MSHP-5MS
Column length (m) 30.30.30.30.30.
Carrier gas HeHeHeHeHe
Substrate
Column diameter (mm) 0.250.260.250.250.25
Phase thickness (μm) 0.250.250.250.250.25
Tstart (C) 50.60.50.60.60.
Tend (C) 240.246.280.180.280.
Heat rate (K/min) 3.3.5.3.2.
Initial hold (min) 3. 3. 8.
Final hold (min)    15.30.
I 933.953.945.947.951.
ReferenceKartal N., Sokmen M., et al., 2007Adams, González Elizondo, et al., 2006Allegrone, Belliardo, et al., 2006Angioni, Barra, et al., 2006Hazzit, Baaliouamer, et al., 2006
Comment MSDC-RI MSDC-RI MSDC-RI MSDC-RI MSDC-RI
Column type CapillaryCapillaryCapillaryCapillaryCapillary
Active phase HP-5MSDB-5HP-5BP-1BP-1
Column length (m) 60.30.25.25.30.
Carrier gas HeHe N2N2
Substrate
Column diameter (mm) 0.250.250.20.320.32
Phase thickness (μm) 0.250.250.330.250.25
Tstart (C) 40.60.60.60.60.
Tend (C) 250. 240.220.220.
Heat rate (K/min) 3.3.3.5.5.
Initial hold (min) 1.
Final hold (min) 20.  13.3.
I 952.955.952.947.944.
ReferenceJalali-Heravi, Zekavat, et al., 2006Lucero, Fredrickson, et al., 2006Oliveira, Leitao, et al., 2006Raina, Verma, et al., 2006Srivastava, Srivastava, et al., 2006
Comment MSDC-RI MSDC-RI MSDC-RI MSDC-RI MSDC-RI
Column type CapillaryCapillaryCapillaryCapillaryCapillary
Active phase SPB-1DB-5DB-5DB-5HP-5MS
Column length (m) 30.30.30.10.30.
Carrier gas HeHeHeHeHe
Substrate
Column diameter (mm) 0.320.260.260.10.25
Phase thickness (μm) 0.250.250.250.10.25
Tstart (C) 60.60.60.60.50.
Tend (C) 240.246.246.240.250.
Heat rate (K/min) 4.3.3.5.3.
Initial hold (min) 4.  5.10.
Final hold (min) 2.  10.5.
I 942.954.953.956.954.
ReferenceWalde, Jyothirmayi, et al., 2006Adams, Morris, et al., 2005Adams and Nguyen, 2005Asfaw, Licence, et al., 2005Asuming, Beauchamp, et al., 2005
Comment MSDC-RI MSDC-RI MSDC-RI MSDC-RI MSDC-RI
Column type CapillaryCapillaryCapillaryCapillaryCapillary
Active phase DB-5MSDB-5DB-5DB-5MSHP-5MS
Column length (m) 30.30. 30.30.
Carrier gas HeHelium HeHe
Substrate
Column diameter (mm) 0.250.25 0.250.25
Phase thickness (μm) 0.250.25 0.250.25
Tstart (C) 60.60.60.60.60.
Tend (C) 240.255.240.180.200.
Heat rate (K/min) 3.3.3.3.4.
Initial hold (min)    15.1.
Final hold (min)     15.
I 952.955.952.952.953.
ReferenceMaia, Andrade, et al., 2005Medina, Lucero, et al., 2005Shatar S., 2005Angioni, Barra, et al., 2004Juliani, Zygadlo, et al., 2004
Comment MSDC-RI MSDC-RI MSDC-RI MSDC-RI MSDC-RI
Column type CapillaryCapillaryCapillaryCapillaryCapillary
Active phase HP-5CP Sil 5 CBDB-5DB-5HP-5MS
Column length (m) 30.25.25.50.30.
Carrier gas HeH2HeHeHe
Substrate
Column diameter (mm) 0.250.250.250.320.25
Phase thickness (μm) 0.250.15 0.250.25
Tstart (C) 60.50.40.50.50.
Tend (C) 260.230.280.280.280.
Heat rate (K/min) 3.3.3.5.4.
Initial hold (min)   5.2.2.
Final hold (min)   5.10.10.
I 953.951.946.964.949.
ReferenceLopes, Strobl, et al., 2004Ogunwande, Olawore, et al., 2004Amparo Blázquez, Pérez, et al., 2003Baranauskiene, Venskutonis, et al., 2003Baranauskiene, Venskutonis, et al., 2003, 2
Comment MSDC-RI MSDC-RI MSDC-RI MSDC-RI MSDC-RI
Column type CapillaryCapillaryCapillaryCapillaryCapillary
Active phase HP-5HP-5MSHP-5MSDB-5CP Sil 5 CB
Column length (m) 30.30.30.30.25.
Carrier gas HeHeHeHeHe
Substrate
Column diameter (mm) 0.250.250.250.250.25
Phase thickness (μm) 1.0.250.250.250.15
Tstart (C) 40.60.60.60.50.
Tend (C) 250.280.280. 230.
Heat rate (K/min) 5.3.3.3.3.
Initial hold (min) 1.
Final hold (min)
I 958.936.930.954.951.
ReferenceBouzouita, Kachouri, et al., 2003Couladis, Chinou, et al., 2003Gkinis, Tzakou, et al., 2003Lucero, Estell, et al., 2003Ogunwande, Olawore, et al., 2003
Comment MSDC-RI MSDC-RI MSDC-RI MSDC-RI MSDC-RI
Column type CapillaryCapillaryCapillaryCapillaryCapillary
Active phase CP Sil 5 CBHP-5BP-1DB-5DB-5
Column length (m) 25.30.25.30.60.
Carrier gas H2HeN2HeHe
Substrate
Column diameter (mm) 0.250.250.550.250.32
Phase thickness (μm) 0.150.250.250.251.
Tstart (C) 50.60.60.50.40.
Tend (C) 230.280.220.250.230.
Heat rate (K/min) 3.3.5.0.53.
Initial hold (min)    5.5.
Final hold (min)   15.10.2.
I 951.941.950.950.960.
ReferenceOgunwande, Olawore, et al., 2003, 2Özcan, Tzakou, et al., 2003Srivastava, Ahmad, et al., 2003Viña and Murillo, 2003Buchin, Salmon, et al., 2002
Comment MSDC-RI MSDC-RI MSDC-RI MSDC-RI MSDC-RI
Column type CapillaryCapillaryCapillaryCapillaryCapillary
Active phase SE-30HP-5CP Sil 5 CBDB-1Methyl Silicone
Column length (m) 30.30.25.25.50.
Carrier gas HeHeHeHeHe
Substrate
Column diameter (mm) 0.250.250.250.20.25
Phase thickness (μm)  0.25  0.25
Tstart (C) 60.60.50.60.70.
Tend (C) 240.200.230.220.240.
Heat rate (K/min) 4.4.3.3.4.
Initial hold (min)  1.
Final hold (min)  15.
I 953.951.951.947.941.
ReferenceJuliani, Koroch, et al., 2002Juliani and Simon, 2002Kasali, Adio, et al., 2002Mevy, Bessiere, et al., 2002Palá-Paúl, Pérez-Alonso, et al., 2002
Comment MSDC-RI MSDC-RI MSDC-RI MSDC-RI MSDC-RI
Column type CapillaryCapillaryCapillaryCapillaryCapillary
Active phase SE-30BP-1BP-1BP-1HP-5MS
Column length (m) 25.60.25.25.30.
Carrier gas HeN2N2N2He
Substrate
Column diameter (mm) 0.220.320.320.550.25
Phase thickness (μm) 0.250.250.250.250.25
Tstart (C) 70.60.60.60.50.
Tend (C) 220.220.220.220.250.
Heat rate (K/min) 4.5.5.5.3.
Initial hold (min)
Final hold (min)   15.15.
I 943.950.950.946.951.
ReferencePalá-Paúl, Velasco-Negueruela, et al., 2002Raina, Lal, et al., 2002Raina, Srivastava, et al., 2002Raina, Srivastava, et al., 2002, 2Salido, Altarejos, et al., 2002
Comment MSDC-RI MSDC-RI MSDC-RI MSDC-RI MSDC-RI
Column type CapillaryCapillaryCapillaryCapillaryCapillary
Active phase BP-1BP-1DB-1BP-1DB-1
Column length (m) 30.25.28.25.30.
Carrier gas N2N2HeN2He
Substrate
Column diameter (mm) 0.320.550.250.550.25
Phase thickness (μm) 0.250.250.250.250.25
Tstart (C) 60.60.50.60.40.
Tend (C) 220.220.270.220.260.
Heat rate (K/min) 5.5.4.55.2.
Initial hold (min)   1. 5.
Final hold (min) 13.15. 15.20.
I 944.946.957.944.941.
ReferenceShawl, Srivastava, et al., 2002Jain, Aggarwal, et al., 2001Nagalakshmi, Thangadurai, et al., 2001Raina, Srivastava, et al., 2001Senatore and Rigano, 2001
Comment MSDC-RI MSDC-RI MSDC-RI MSDC-RI MSDC-RI
Column type CapillaryCapillaryCapillaryCapillaryCapillary
Active phase HP-5DB-1SE-54DB-5SE-54
Column length (m) 30.30.30.30.30.
Carrier gas He HeHe
Substrate
Column diameter (mm) 0.250.250.260.260.26
Phase thickness (μm) 0.250.250.250.250.25
Tstart (C) 60.80.60.60.60.
Tend (C) 280.225.246.240.246.
Heat rate (K/min) 3.4.3.3.3.
Initial hold (min)
Final hold (min)
I 952.941.953.953.953.
ReferenceTzakou and Couladis, 2001Abella, Cortella, et al., 2000Adams, 2000Adams, 2000, 2Adams, 2000, 3
Comment MSDC-RI MSDC-RI MSDC-RI MSDC-RI MSDC-RI
Column type CapillaryCapillaryCapillaryCapillaryCapillary
Active phase DB-5SE-30HP-5HP-5MSDB-5
Column length (m) 30.25.30.30.30.
Carrier gas HeHeHeHe
Substrate
Column diameter (mm) 0.260.220.320.250.32
Phase thickness (μm) 0.250.250.250.25
Tstart (C) 60.70.70.60.50.
Tend (C) 246.220.250.280.250.
Heat rate (K/min) 3.5.3.3.3.
Initial hold (min)     5.
Final hold (min)
I 953.945.943.952.952.
ReferenceAdams, 2000, 4Kardali, Velasco-Negueruela, et al., 2000Ramos, Siani, et al., 2000Roussis, Tsoukatou, et al., 2000Tzakou, Harvala, et al., 2000
Comment MSDC-RI MSDC-RI MSDC-RI MSDC-RI MSDC-RI
Column type CapillaryCapillaryCapillaryCapillaryCapillary
Active phase DB-5SE-30CP Sil 5 CBOV-101HP-5
Column length (m) 30.25.25.25.30.
Carrier gas HeHeHe He
Substrate
Column diameter (mm) 0.260.20.250.320.25
Phase thickness (μm) 0.25   0.25
Tstart (C) 60.60.60.50.60.
Tend (C) 246.180.280.200.280.
Heat rate (K/min) 3.3.5.5.4.
Initial hold (min)  10.
Final hold (min)
I 953.948.953.944.947.
ReferenceAdams, 1999Jantan I. and Ahmad A.S., 1999Kaul, Gujral, et al., 1999Kuiate, Zollo, et al., 1999Sajjadi and Ghassemi, 1999
Comment MSDC-RI MSDC-RI MSDC-RI MSDC-RI MSDC-RI
Column type CapillaryCapillaryCapillaryCapillaryCapillary
Active phase DB-5DB-5BP-1BP-1Methyl Silicone
Column length (m) 30.30.50.50.30.
Carrier gas HeHe  He
Substrate
Column diameter (mm) 0.250.250.250.250.32
Phase thickness (μm) 0.330.250.250.250.25
Tstart (C) 40.60.60.60.60.
Tend (C) 260.240.260.260.250.
Heat rate (K/min) 2.3.2.2.2.
Initial hold (min) 5.   2.
Final hold (min) 20.   5.
I 929.948.948.954.949.
ReferenceSenatore and de Feo, 1999da Silva, Andrade, et al., 1999Vera and Chane-Ming, 1999Vera and Chane-Ming, 1999Adegoke, Rao, et al., 1998
Comment MSDC-RI MSDC-RI MSDC-RI MSDC-RI MSDC-RI
Column type CapillaryCapillaryCapillaryCapillaryCapillary
Active phase DB-1DB-5CP Sil 5 CBBP-1Methyl Silicone
Column length (m) 60.30.25.25.25.
Carrier gas HeHe N2N2
Substrate
Column diameter (mm) 0.250.250.250.250.5
Phase thickness (μm) 0.250.25
Tstart (C) 50.40.60.60.60.
Tend (C) 250.250.280.220.220.
Heat rate (K/min) 3.2.5.5.5.
Initial hold (min) 5.5.
Final hold (min) 10.20.
I 940.929.941.946.948.
ReferenceBylaite, Venskutonis, et al., 1998de Feo, Porta, et al., 1998Kaul and Vats, 1998Kulkarni, Mallavarapu, et al., 1998Mallavarapu, Rao, et al., 1998
Comment MSDC-RI MSDC-RI MSDC-RI MSDC-RI MSDC-RI
Column type CapillaryCapillaryCapillaryCapillaryCapillary
Active phase BP-1DB-1BPX-5DB-5DB-5
Column length (m) 50.30.50.30.30.
Carrier gas HeHeN2HeHe
Substrate
Column diameter (mm) 0.220.230.220.250.25
Phase thickness (μm) 1. 0.250.250.25
Tstart (C) 50.50.60.40.60.
Tend (C) 220.200.185.250.240.
Heat rate (K/min) 3.3.2.2.3.
Initial hold (min)   10.5.
Final hold (min)    20.
I 953.943.953.929.953.
ReferenceBreheret, Talou, et al., 1997Fiorini, Fourasté, et al., 1997Fournier, Hadjiakhoondi, et al., 1997Senatore, Urrunaga Soria, et al., 1997Tellez, Estell, et al., 1997
Comment MSDC-RI MSDC-RI MSDC-RI MSDC-RI MSDC-RI
Column type CapillaryCapillaryCapillaryCapillaryCapillary
Active phase SE-30SE-30DB-5DB-5OV-101
Column length (m) 25.25.30.30.25.
Carrier gas N2N2  N2
Substrate
Column diameter (mm) 0.20.2  0.25
Phase thickness (μm)
Tstart (C) 60.60.40.40.50.
Tend (C) 180.180.210.210.200.
Heat rate (K/min) 3.3.2.2.5.
Initial hold (min) 10.10.2.2.
Final hold (min) 1.1.120.120.
I 948.948.951.950.948.
ReferenceJantan, Ahmad, et al., 1996Jantan, Ali, et al., 1995Loayza, Abujder, et al., 1995Loayza, Abujder, et al., 1995Menut, Molangui, et al., 1995
Comment MSDC-RI MSDC-RI MSDC-RI MSDC-RI MSDC-RI
Column type CapillaryCapillaryCapillaryCapillaryCapillary
Active phase SPB-1SE-54BP-1DB-1DB-1
Column length (m) 50.30.50.60.60.
Carrier gas HeHeH2HeHe
Substrate
Column diameter (mm) 0.200.250.330.250.25
Phase thickness (μm)  0.25 1.1.
Tstart (C) 35.0.65.40.40.
Tend (C) 200.250.220.250.250.
Heat rate (K/min) 3.12.5.12.4.
Initial hold (min) 5.12.2.4.
Final hold (min) 20.
I 953.938.953.980.968.
ReferenceWong and Tie, 1993Rembold, Wallner, et al., 1989Ekundayo, Laakso, et al., 1988Burns and Tingey, 1983Burns and Tingey, 1983
Comment MSDC-RI MSDC-RI MSDC-RI MSDC-RI MSDC-RI

Normal alkane RI, polar column, temperature ramp

Data compiled by: NIST Mass Spectrometry Data Center, William E. Wallace, director

Column type CapillaryCapillaryCapillaryCapillaryCapillary
Active phase RTX-WaxInnowaxBP-20HP-InnowaxHP-Innowax
Column length (m) 60.30.50.60.30.
Carrier gas HeliumHeliumHeliumHeliumHelium
Substrate
Column diameter (mm) 0.220.250.220.250.25
Phase thickness (μm) 0.250.250.250.250.25
Tstart (C) 60.40.60.60.50.
Tend (C) 230.250.220.220.250.
Heat rate (K/min) 2.8.2.5.5.
Initial hold (min)  1. 1.5.
Final hold (min) 5.2.7520.5.10.
I 1056.1065.1068.1077.1076.
ReferenceBendiabdellah, El Amine Dib, et al., 2012Siristova, Prinosilova, et al., 2012Yapi, Boti, et al., 2012Feng, Cui, et al., 2011Menichini, Tundis, et al., 2011
Comment MSDC-RI MSDC-RI MSDC-RI MSDC-RI MSDC-RI
Column type CapillaryCapillaryCapillaryCapillaryCapillary
Active phase DB-WaxSupelcowax-10RTX-WaxBP-20Innowax
Column length (m) 30.30.60.50.30.
Carrier gas HeliumHeliumHeliumHeliumHelium
Substrate
Column diameter (mm) 0.250.200.220.220.25
Phase thickness (μm) 0.250.200.250.250.25
Tstart (C) 40.70.60.60.40.
Tend (C) 230.220.230.220.250.
Heat rate (K/min) 4.3.2.2.6.
Initial hold (min) 2.   1.
Final hold (min) 4.515.30.20.4.
I 1082.1074.1045.1066.1064.
ReferenceZeng, Xie, et al., 2011Neves, Rosa, et al., 2010Museli, Pau, et al., 2009Ottavioli, Bighelli, et al., 2009Seo, Kim, et al., 2009
Comment MSDC-RI MSDC-RI MSDC-RI MSDC-RI MSDC-RI
Column type CapillaryCapillaryCapillaryCapillaryCapillary
Active phase HP-InnowaxDB-WaxDB-WaxHP-InnowaxCP-Wax 52CB
Column length (m) 30.60.60.30.60.
Carrier gas NitrogenHeliumHeliumN2He
Substrate
Column diameter (mm) 0.250.320.320.250.25
Phase thickness (μm) 0.520.250.250.250.25
Tstart (C) 35.30.30.50.40.
Tend (C) 205.200.200.240.220.
Heat rate (K/min) 3.2.2.5.3.
Initial hold (min) 10.4.4.1.
Final hold (min) 10.30.30.4.
I 1076.1058.1063.1052.1084.
ReferenceWannes, Mhamdi, et al., 2009Beck, Higbee, et al., 2008Beck, Higbee, et al., 2008Cheraif, Ben Jannet, et al., 2007Chyau, Tsai, et al., 2007
Comment MSDC-RI MSDC-RI MSDC-RI MSDC-RI MSDC-RI
Column type CapillaryCapillaryCapillaryCapillaryCapillary
Active phase CarbowaxTC-FFAPTC-FFAPDB-WaxSupelcowax-10
Column length (m) 60.  60.30.
Carrier gas HeHeHeHeHe
Substrate
Column diameter (mm) 0.20.250.250.320.2
Phase thickness (μm) 0.250.250.250.250.2
Tstart (C) 60.60.60.70.70.
Tend (C) 250.220.220.220.220.
Heat rate (K/min) 2.3.3.4.3.
Initial hold (min) 8.
Final hold (min) 15.30.30. 15.
I 1103.1079.1078.1056.1077.
ReferenceFerhat, Meklati, et al., 2007Kurose, Okamura, et al., 2007Kurose, Okamura, et al., 2007Pala-Paul, Brophy, et al., 2007Pinto, Salgueiro, et al., 2007
Comment MSDC-RI MSDC-RI MSDC-RI MSDC-RI MSDC-RI
Column type CapillaryCapillaryCapillaryCapillaryCapillary
Active phase Supelcowax-10CarbowaxSupelcowax-10Supelcowax-10DB-Wax
Column length (m) 30.60.30.30.60.
Carrier gas HeHe HeHe
Substrate
Column diameter (mm) 0.250.250.250.250.25
Phase thickness (μm) 0.250.250.250.250.25
Tstart (C) 50.40.40.40.60.
Tend (C) 250.180.250.250.180.
Heat rate (K/min) 2.5.2.3.3.
Initial hold (min)    5.8.
Final hold (min)   33.10.80.
I 1069.1081.1070.1056.1063.
ReferenceRaal, Orav, et al., 2007Singh, Kumar, et al., 2007Sylvestre, Pichette, et al., 2007Vichi, Riu-Aumatell, et al., 2007Wei A. and Shibamoto T., 2007
Comment MSDC-RI MSDC-RI MSDC-RI MSDC-RI MSDC-RI
Column type CapillaryCapillaryCapillaryCapillaryCapillary
Active phase InnowaxInnowaxAT-WaxSupelcowax 10DB-Wax
Column length (m) 30.30.60.30.60.
Carrier gas N2N2HeHeliumHe
Substrate
Column diameter (mm) 0.250.250.250.200.25
Phase thickness (μm) 0.250.250.250.200.25
Tstart (C) 50.50.60.70.70.
Tend (C) 280.280.200.220.230.
Heat rate (K/min) 9.9.4.3.2.
Initial hold (min) 3.3.  2.
Final hold (min) 3.3.20.15.20.
I 1079.1085.1086.1073.1082.
ReferenceAbdelwahed, Hayder, et al., 2006Abdelwahed, Hayder, et al., 2006Borges, Rojas, et al., 2006Cavaleiro, Pinto, et al., 2006Choi H.S., 2006
Comment MSDC-RI MSDC-RI MSDC-RI MSDC-RI MSDC-RI
Column type CapillaryCapillaryCapillaryCapillaryCapillary
Active phase DB-WaxHP-20MFFAPDB-WaxSupelcowax
Column length (m) 60.50.20.60.30.
Carrier gas N2HeHe N2
Substrate
Column diameter (mm) 0.250.20.250.250.32
Phase thickness (μm) 0.250.10.250.250.25
Tstart (C) 70.60.90.70.50.
Tend (C) 230.220.250.230.200.
Heat rate (K/min) 2.2.6.2.5.
Initial hold (min) 2.  2.
Final hold (min) 20.30. 20.
I 1081.1043.1100.1077.1080.
ReferenceChoi, 2006Filippi, Lanfranchi, et al., 2006Kitchlu, Bakshi, et al., 2006Lan Phi N.T., Nishiyama C., et al., 2006Martin, Joseph, et al., 2006
Comment MSDC-RI MSDC-RI MSDC-RI MSDC-RI MSDC-RI
Column type CapillaryCapillaryCapillaryCapillaryCapillary
Active phase HP-WaxHP-20MHP-20MDB-InnowaxNB-20M
Column length (m) 30.30.50.60.30.
Carrier gas NitrogenN2HeHeliumHe
Substrate
Column diameter (mm) 0.250.250.20.250.2
Phase thickness (μm) 0.250.250.20.250.25
Tstart (C) 50.50.70.60.50.
Tend (C) 280.250.180.240.250.
Heat rate (K/min) 5.5.4.3.2.
Initial hold (min)   4.
Final hold (min) 5.10.15.20.
I 1068.1068.1059.1083.1055.
ReferenceMarzouk, Mansour, et al., 2006Marzouk, Neffati, et al., 2006Mastelic, Jerkovic, et al., 2006Mendivil, Rodrigues, et al., 2006Orav, Raal, et al., 2006
Comment MSDC-RI MSDC-RI MSDC-RI MSDC-RI MSDC-RI
Column type CapillaryCapillaryCapillaryCapillaryCapillary
Active phase DB-WaxSupelcowax-10Supelcowax-10Carbowax 20MStabilwax
Column length (m) 60.30.30.50.30.
Carrier gas  HeHe H2
Substrate
Column diameter (mm) 0.250.250.250.20.32
Phase thickness (μm) 0.250.250.250.250.5
Tstart (C) 70.50.50.60.40.
Tend (C) 230.220.250.250.280.
Heat rate (K/min) 2.4.4.2.6.
Initial hold (min) 2.1.1.60.5.
Final hold (min) 20.10.10. 5.
I 1079.1066.1045.1071.1076.
ReferenceSawamura, Onishi, et al., 2006Wong, Lim, et al., 2006Wong, Sivasothy, et al., 2006Fernandez, Lizzani-Cuvelier, et al., 2005Jirovetz, Buchbauer, et al., 2005
Comment MSDC-RI MSDC-RI MSDC-RI MSDC-RI MSDC-RI
Column type CapillaryCapillaryCapillaryCapillaryCapillary
Active phase DB-WaxDB-WaxCP-Wax 52CBSupelcowax-10Supelcowax-10
Column length (m) 60.60.30.30.30.
Carrier gas N2NitrogenHe
Substrate
Column diameter (mm) 0.250.320.320.250.25
Phase thickness (μm) 0.250.500.250.250.25
Tstart (C) 70.35.40.40.40.
Tend (C) 230.235.220.210.220.
Heat rate (K/min) 2.2.4.2.3.
Initial hold (min) 2.4.1.2.5.
Final hold (min) 20.30. 33.10.
I 1083.1075.1070.1053.1056.
ReferenceNjoroge, Koaze, et al., 2005Qian and Wang, 2005Rohloff and Bones, 2005Stevanovic, Garneau, et al., 2005Vichi, Riu-Aumatell, et al., 2005
Comment MSDC-RI MSDC-RI MSDC-RI MSDC-RI MSDC-RI
Column type CapillaryCapillaryCapillaryCapillaryCapillary
Active phase Supelcowax-10BP-20DB-WaxDB-WaxSupelcowax-10
Column length (m) 30.50.60.60.60.
Carrier gas He N2N2He
Substrate
Column diameter (mm) 0.250.220.250.250.2
Phase thickness (μm) 0.250.250.250.250.2
Tstart (C) 50.60.70.70.60.
Tend (C) 220.220.230.230.200.
Heat rate (K/min) 4.2.2.2.4.
Initial hold (min) 3. 2.2.
Final hold (min) 30.20.20.20.40.
I 1078.1064.1084.1090.1051.
ReferenceWong, Lee, et al., 2005Blanc, Muselli, et al., 2004Choi, 2004Choi, 2004, 2Gauvin, Ravaomanarivo, et al., 2004
Comment MSDC-RI MSDC-RI MSDC-RI MSDC-RI MSDC-RI
Column type CapillaryCapillaryCapillaryCapillaryCapillary
Active phase Supelcowax-10Innowax FSCBP-20Supelcowax-10Supelcowax-10
Column length (m) 30.60.25.50.50.
Carrier gas  HeliumN2HeHe
Substrate
Column diameter (mm) 0.250.250.250.20.2
Phase thickness (μm) 0.25 0.250.250.25
Tstart (C) 40.60.60.70.70.
Tend (C) 210.220.220.230.230.
Heat rate (K/min) 2.4.5.2.2.
Initial hold (min) 2.10.
Final hold (min) 33.
I 1070.1076.1090.1072.1074.
ReferenceLopez Arze, Collin, et al., 2004Lourens, Reddy, et al., 2004Mallavarapu, Kulkarni, et al., 2004Orav, Stulova, et al., 2004Orav, Stulova, et al., 2004
Comment MSDC-RI MSDC-RI MSDC-RI MSDC-RI MSDC-RI
Column type CapillaryCapillaryCapillaryCapillaryCapillary
Active phase NB-20MSW-10DB-WaxDB-WaxSupelcowax-10
Column length (m) 50.50.60.60.30.
Carrier gas HeHe NitrogenHe
Substrate
Column diameter (mm) 0.20.200.250.250.25
Phase thickness (μm) 0.250.250.250.250.25
Tstart (C) 50.50.70.70.60.
Tend (C) 250.230.230.230.240.
Heat rate (K/min) 2.2.2.2.4.
Initial hold (min)   2.2.
Final hold (min)   20.
I 1063.1072.1079.1079.1065.
ReferenceRaal, Arak, et al., 2004Raal, Paaver, et al., 2004Sawamura, Son, et al., 2004Sawamura, Sou, et al., 2004Cabanillas, Lopez, et al., 2003
Comment MSDC-RI MSDC-RI MSDC-RI MSDC-RI MSDC-RI
Column type CapillaryCapillaryCapillaryCapillaryCapillary
Active phase CP-Wax 52CBDB-WaxSupelcowax-10Carbowax 20MHP-Innowax
Column length (m) 60.60.50.50.50.
Carrier gas HeHeliumHeN2
Substrate
Column diameter (mm) 0.250.250.20.250.2
Phase thickness (μm) 0.25 0.250.250.2
Tstart (C) 40.70.70.90.50.
Tend (C) 220.210.230.220.220.
Heat rate (K/min) 3.2.2.3.4.
Initial hold (min)     5.
Final hold (min)  60.
I 1062.1086.1074.1073.1066.
ReferenceMau, Lai, et al., 2003Mookdasanit, Tamura, et al., 2003Orav, Kailas, et al., 2003Priestap, van Baren, et al., 2003Stashenko, Jaramillo, et al., 2003
Comment MSDC-RI MSDC-RI MSDC-RI MSDC-RI MSDC-RI
Column type CapillaryCapillaryCapillaryCapillaryCapillary
Active phase InnowaxDB-WaxDB-WaxHP-InnowaxCarbowax 20M
Column length (m) 60.60.60.50.25.
Carrier gas HeN2N2HeN2
Substrate
Column diameter (mm) 0.250.250.250.20.25
Phase thickness (μm)  0.250.250.20.25
Tstart (C) 60.70.70.70.50.
Tend (C) 220.230.230.190.250.
Heat rate (K/min) 4.2.2.5.4.
Initial hold (min) 10.2.2.
Final hold (min) 10.20.20. 10.
I 1076.1061.1068.1088.1085.
ReferenceSuleimenov, Atazharova, et al., 2003Tu, Onishi, et al., 2003Tu, Onishi, et al., 2003, 2Velasco-Negueruela, Pérez-Alonso, et al., 2003Zrira, Elamrani, et al., 2003
Comment MSDC-RI MSDC-RI MSDC-RI MSDC-RI MSDC-RI
Column type CapillaryCapillaryCapillaryCapillaryCapillary
Active phase RTX-WaxDB-WaxCP-Wax 52CBCarbowax 20MHP-Wax
Column length (m) 60.60.30.30.50.
Carrier gas HeH2N2HeN2
Substrate
Column diameter (mm) 0.250.320.320.250.25
Phase thickness (μm) 0.50.250.250.3250.25
Tstart (C) 40.40.60.50.75.
Tend (C) 180.245.300.215.220.
Heat rate (K/min) 5.1.54.4.3.
Initial hold (min) 5.   4.
Final hold (min) 20.20. 20.
I 1085.1053.1042.1083.1073.
ReferenceGalindo-Cuspinera, Lubran, et al., 2002Gancel, Ollé, et al., 2002Góra, Lis, et al., 2002Kasali, Winterhalter, et al., 2002Priestap, van Baren, et al., 2002
Comment MSDC-RI MSDC-RI MSDC-RI MSDC-RI MSDC-RI
Column type CapillaryCapillaryCapillaryCapillaryCapillary
Active phase DB-WaxDB-WaxDB-WaxDB-WaxTC-Wax
Column length (m) 60.60.60.60.60.
Carrier gas N2N2HeHeHe
Substrate
Column diameter (mm) 0.250.250.250.250.25
Phase thickness (μm) 0.250.250.25
Tstart (C) 70.70.45.40.80.
Tend (C) 230.230.240.220.250.
Heat rate (K/min) 2.2.3.2.4.
Initial hold (min) 2.
Final hold (min) 20.   47.
I 1071.1083.1066.1089.1064.
ReferenceTu, Onishi, et al., 2002Tu, Thanh, et al., 2002Christoph, 2001Jiang and Kubota, 2001Miyazawa, Kurose, et al., 2001
Comment MSDC-RI MSDC-RI MSDC-RI MSDC-RI MSDC-RI
Column type CapillaryCapillaryCapillaryCapillaryCapillary
Active phase Carbowax 20MCP-Wax 52CBDB-WaxSupelcowax-10Supelcowax-10
Column length (m) 50.50.30.30.60.
Carrier gas HeHeHeHeHe
Substrate
Column diameter (mm) 0.220.300.20.320.25
Phase thickness (μm) 0.250.25 0.250.25
Tstart (C) 60.40.50.70.60.
Tend (C) 220.220.180.240.280.
Heat rate (K/min) 2.3.3.5.4.
Initial hold (min)  5.8.8.
Final hold (min)    20.
I 1080.1083.1052.1033.1057.
ReferenceVernin, Lageot, et al., 2001Chagonda, Makanda, et al., 2000Franco and Shibamoto, 2000Kim, Kim, et al., 2000Korány, Mednyánszky, et al., 2000
Comment MSDC-RI MSDC-RI MSDC-RI MSDC-RI MSDC-RI
Column type CapillaryCapillaryCapillaryCapillaryCapillary
Active phase BP-20DB-WaxDB-WaxCW 20MSupelcowax-10
Column length (m) 25.60.60.25.30.
Carrier gas NitrogenNitrogenHeHydrogen
Substrate
Column diameter (mm) 0.500.250.250.320.25
Phase thickness (μm) 0.25 0.250.250.25
Tstart (C) 60.40.40.50.60.
Tend (C) 200.200.200.220.220.
Heat rate (K/min) 5.2.2.3.4.
Initial hold (min)  10.2.1.
Final hold (min)    10.
I 1057.1086.1064.1058.1062.
ReferenceMallavarapu, Rao, et al., 2000Tamura, Boonbumrung, et al., 2000Umano, Hagi, et al., 2000Bicchi, Binello, et al., 1999Choo, Wong, et al., 1999
Comment MSDC-RI MSDC-RI MSDC-RI MSDC-RI MSDC-RI
Column type CapillaryCapillaryCapillaryCapillaryCapillary
Active phase InnowaxHP-InnowaxDB-WaxNB-351BP-20
Column length (m) 60.60.60.25.25.
Carrier gas HeHeHeH2N2
Substrate
Column diameter (mm) 0.250.250.250.30.5
Phase thickness (μm) 0.250.250.250.5
Tstart (C) 60.60.60.70.60.
Tend (C) 220.220.240.250.200.
Heat rate (K/min)   4.5.5.
Initial hold (min) 10.10. 2.
Final hold (min)
I 1076.1076.1069.1066.1055.
ReferenceKaya, Baser, et al., 1999Kaya, Baser, et al., 1999, 2Ngassoum, Yonkeu, et al., 1999Onocha, Ekundayo, et al., 1999Rao, Bhattacharya, et al., 1999
Comment MSDC-RI MSDC-RI MSDC-RI MSDC-RI MSDC-RI
Column type CapillaryCapillaryCapillaryCapillaryCapillary
Active phase DB-WaxBP-20DB-WaxHP-InnowaxBP-20
Column length (m) 60.25.30.60.25.
Carrier gas N2H2N2HeH2
Substrate
Column diameter (mm)  0.330.250.250.33
Phase thickness (μm) 0.250.50.250.250.5
Tstart (C) 60.80.45.50.80.
Tend (C) 220.220.220.220.220.
Heat rate (K/min) 5.5.3.5.5.
Initial hold (min)    5.
Final hold (min)
I 1082.1085.1066.1114.1085.
ReferenceWeyerstahl, Marschall, et al., 1999Bignell, Dunlop, et al., 1998Mölleken, Sinnwell, et al., 1998Stashenko, Cervantes, et al., 1998Bignell, Dunlop, et al., 1997
Comment MSDC-RI MSDC-RI MSDC-RI MSDC-RI MSDC-RI
Column type CapillaryCapillaryCapillaryCapillaryCapillary
Active phase BP-20BP-20BP-20BP-20Supelcowax-10
Column length (m) 25.25.25.25.30.
Carrier gas H2H2 H2
Substrate
Column diameter (mm) 0.330.330.330.330.25
Phase thickness (μm) 0.50.50.50.5
Tstart (C) 80.80.80.80.60.
Tend (C) 220.220.220.220.240.
Heat rate (K/min) 5.5.5.5.4.
Initial hold (min)
Final hold (min)
I 1085.1085.1085.1085.1066.
ReferenceBignell, Dunlop, et al., 1997, 2Bignell, Dunlop, et al., 1997, 3Bignell, Dunlop, et al., 1997, 4Bignell, Dunlop, et al., 1997, 5Zunino, Novillo-Newton, et al., 1997
Comment MSDC-RI MSDC-RI MSDC-RI MSDC-RI MSDC-RI
Column type CapillaryCapillaryCapillaryCapillaryCapillary
Active phase SP-1000PEG-20MPEG-20MCarbowax 20MSupelcowax-10
Column length (m) 85.50.60.60.
Carrier gas HeHeHeHe
Substrate
Column diameter (mm) 0.500.250.320.25
Phase thickness (μm)   0.250.25
Tstart (C) 65.70.70.50.40.
Tend (C) 225.250.180.150.210.
Heat rate (K/min) 3.2.2.2.2.
Initial hold (min)   7.10.2.
Final hold (min)    20.120.
I 1065.1075.1083.1083.1066.
ReferenceBrophy, Goldsack, et al., 1996Orav, Kailas, et al., 1996Orav, Kuningas, et al., 1995Tirado, Stashenko, et al., 1995Collin, Deslauriers, et al., 1993
Comment MSDC-RI MSDC-RI MSDC-RI MSDC-RI MSDC-RI
Column type CapillaryCapillaryCapillaryCapillaryCapillary
Active phase Supelcowax-10Carbowax 20MDB-WaxFFAPDB-Wax
Column length (m)  45.30.50.30.
Carrier gas  Hydrogen  H2
Substrate
Column diameter (mm)  0.320.32 0.25
Phase thickness (μm)  1.0  0.25
Tstart (C) 40.60.70.50.50.
Tend (C) 210.200.200.180.250.
Heat rate (K/min) 2.2.4.10.5.
Initial hold (min) 2.5.2.1.
Final hold (min) 120.
I 1066.1079.1080.1075.1039.
ReferenceCollin, Deslauriers, et al., 1993Kollmannsberger, Nitz, et al., 1992Wyllie, Brophy, et al., 1990Brophy, Davies, et al., 1989Perry, Baxter, et al., 1986
Comment MSDC-RI MSDC-RI MSDC-RI MSDC-RI MSDC-RI
Column type CapillaryCapillaryCapillaryPackedPacked
Active phase BP-20Carbowax 20MCarbowax 20MCarbowax 20MCarbowax 20M
Column length (m) 25.100.100.2.2.
Carrier gas    HydrogenHydrogen
Substrate    Gas-Chrom Z (80-100 mesh)Gas-Chrom Z (80-100 mesh)
Column diameter (mm) 0.20.250.25
Phase thickness (μm)
Tstart (C) 70.70.70.65.65.
Tend (C) 180.170.170.220.220.
Heat rate (K/min) 3.1.1.4.4.
Initial hold (min) 5.
Final hold (min)
I 1083.1084.1085.1087.1087.
ReferenceMacLeod and Snyder, 1985Shibamoto and Jennings, 1977Shibamoto and Jennings, 1977Stancher and Pertoldi, 1967Stancher and Pertoldi, 1967
Comment MSDC-RI MSDC-RI MSDC-RI MSDC-RI MSDC-RI
Column type PackedPackedPackedPacked
Active phase Carbowax 20MCarbowax 20MCarbowax 20MCarbowax 20M
Column length (m) 2.2.2.2.
Carrier gas HydrogenHydrogenHydrogenHydrogen
Substrate Gas-Chrom Z (80-100 mesh)Gas-Chrom Z (80-100 mesh)Gas-Chrom Z (80-100 mesh)Gas-Chrom Z (80-100 mesh)
Column diameter (mm)
Phase thickness (μm)
Tstart (C) 65.65.65.65.
Tend (C) 220.220.220.220.
Heat rate (K/min) 4.4.4.4.
Initial hold (min)
Final hold (min)
I 1087.1090.1090.1090.
ReferenceStancher and Pertoldi, 1967Stancher and Pertoldi, 1967Stancher and Pertoldi, 1967Stancher and Pertoldi, 1967
Comment MSDC-RI MSDC-RI MSDC-RI MSDC-RI

References

Hoskovec, Grygarová, et al., 2005
Hoskovec, Michal; Grygarová, Dana; Cvacka, Josef; Streinz, Ludvík; Zima, Jirí; Verevkin, Sergey P.; Koutek, Bohumír,
Determining the vapour pressures of plant volatiles from gas chromatographic retention data,
Journal of Chromatography A, 2005, 1083, 1-2, 161-172, https://doi.org/10.1016/j.chroma.2005.06.006
. [all data]
Kozina, Bychikhina, et al., 1977
Kozina, M.P.; Bychikhina, L.V.; Gal'chenko, G.L.,
The enthalpies of combustion and formation of 2,2-dimethyl-3-methylene bicyclo[2,2,1]heptane and 7-methylenebicyclo[2,2,1]heptane,
Russ. J. Phys. Chem. (Engl. Transl.), 1977, 51, 1258-1259. [all data]
Stephenson and Malanowski, 1987
Stephenson, Richard M.; Malanowski, Stanislaw,
Handbook of the Thermodynamics of Organic Compounds, 1987, https://doi.org/10.1007/978-94-009-3173-2
. [all data]
Stull, 1947
Stull, Daniel R.,
Vapor Pressure of Pure Substances. Organic and Inorganic Compounds,
Ind. Eng. Chem., 1947, 39, 4, 517-540, https://doi.org/10.1021/ie50448a022
. [all data]
Nesmeyanov, Baiden, et al., 1981
Nesmeyanov, A.N.; Baiden, V.N.; Chizhov, Y.V.; Timoshenko, M.M.; Nekrasov, Y.S.; Kritskaya, I.I.,
He(I) photoelectron investigation of functionally substituted camphene derivatives,
Dokl. Akad. Nauk SSSR, 1981, 256, 121. [all data]