Propane, 2-nitro-
- Formula: C3H7NO2
- Molecular weight: 89.0932
- IUPAC Standard InChIKey: FGLBSLMDCBOPQK-UHFFFAOYSA-N
- CAS Registry Number: 79-46-9
- Chemical structure:
View 3d structure (requires JavaScript / HTML 5) - Other names: Dimethylnitromethane; Isonitropropane; 2-Nitropropane; i-C3H7NO2; sec-Nitropropane; Nipar S-20; Nitroisopropane; 2-NP; Nipar S-20 solvent; Nipar S-30 solvent; β-Nitropropane; Rcra waste number U171; NSC 5369

Condensed phase thermochemistry data

Data compiled by: Hussein Y. Afeefy, Joel F. Liebman, and Stephen E. Stein
Quantity | Value | Units | Method | Reference | Comment |
---|---|---|---|---|---|
ΔfH°liquid | -180.3 ± 0.84 | kJ/mol | Ccb | Cass, Fletcher, et al., 1958 | Reanalyzed by Cox and Pilcher, 1970, Original value = -181. ± 1. kJ/mol |
ΔfH°liquid | -183.2 ± 0.71 | kJ/mol | Ccb | Holcomb and Dorsey, 1949 | |
Quantity | Value | Units | Method | Reference | Comment |
ΔcH°liquid | -2000.7 ± 3.6 | kJ/mol | Ccb | Cass, Fletcher, et al., 1958 | Reanalyzed by Cox and Pilcher, 1970, Original value = -2000. ± 1. kJ/mol |
ΔcH°liquid | -1997.6 ± 0.71 | kJ/mol | Ccb | Holcomb and Dorsey, 1949 |

Phase change data

Data compiled as indicated in comments:
BS - Robert L. Brown and Stephen E. Stein
TRC - Thermodynamics Research Center, NIST Boulder Laboratories, Chris Muzny director
AC - William E. Acree, Jr., James S. Chickos
ALS - Hussein Y. Afeefy, Joel F. Liebman, and Stephen E. Stein
Quantity | Value | Units | Method | Reference | Comment |
---|---|---|---|---|---|
Tboil | 393.5 | K | N/A | Weast and Grasselli, 1989 | BS |
Tboil | 393.4 | K | N/A | Toops, 1956 | Uncertainty assigned by TRC = 0.05 K; TRC |
Tboil | 393.5 | K | N/A | Hodge, 1940 | Uncertainty assigned by TRC = 0.6 K; TRC |
Quantity | Value | Units | Method | Reference | Comment |
Tfus | 181.83 | K | N/A | Toops, 1956 | Uncertainty assigned by TRC = 0.05 K; TRC |
Quantity | Value | Units | Method | Reference | Comment |
ΔvapH° | 43.9 | kJ/mol | CGC | Chickos, Hosseini, et al., 1995 | Based on data from 313. to 353. K.; AC |
ΔvapH° | 41.3 ± 0.42 | kJ/mol | V | Holcomb and Dorsey, 1949 | ALS |
Enthalpy of vaporization
ΔvapH (kJ/mol) | Temperature (K) | Method | Reference | Comment |
---|---|---|---|---|
40.9 | 299. | A,EB | Stephenson and Malanowski, 1987 | Based on data from 284. to 394. K. See also Stull, 1947, Toops, 1956, 2, and Dykyj, 1970.; AC |
Antoine Equation Parameters
log10(P) = A − (B / (T + C))
P = vapor pressure (bar)
T = temperature (K)
View plot Requires a JavaScript / HTML 5 canvas capable browser.
Temperature (K) | A | B | C | Reference | Comment |
---|---|---|---|---|---|
254.4 to 393.5 | 4.61144 | 1664.036 | -32.155 | Stull, 1947 | Coefficents calculated by NIST from author's data. |

Reaction thermochemistry data

Data compiled by: John E. Bartmess
Individual Reactions
C3H6NO2- + =
By formula: C3H6NO2- + H+ = C3H7NO2
Quantity | Value | Units | Method | Reference | Comment |
---|---|---|---|---|---|
ΔrH° | 1490. ± 9.2 | kJ/mol | G+TS | Bartmess, Scott, et al., 1979 | gas phase; value altered from reference due to change in acidity scale |
ΔrH° | 1491. ± 12. | kJ/mol | G+TS | Cumming and Kebarle, 1978 | gas phase |
Quantity | Value | Units | Method | Reference | Comment |
ΔrG° | 1464. ± 8.4 | kJ/mol | IMRE | Bartmess, Scott, et al., 1979 | gas phase; value altered from reference due to change in acidity scale |
ΔrG° | 1466. ± 8.4 | kJ/mol | IMRE | Cumming and Kebarle, 1978 | gas phase |

Gas phase ion energetics data

Data evaluated as indicated in comments:
L - Sharon G. Lias
Data compiled as indicated in comments:
B - John E. Bartmess
LLK - Sharon G. Lias, Rhoda D. Levin, and Sherif A. Kafafi
RDSH - Henry M. Rosenstock, Keith Draxl, Bruce W. Steiner, and John T. Herron
Quantity | Value | Units | Method | Reference | Comment |
---|---|---|---|---|---|
IE (evaluated) | 10.74 ± 0.03 | eV | N/A | N/A | L |
Ionization energy determinations
IE (eV) | Method | Reference | Comment |
---|---|---|---|
10.48 | PE | Kimura, Katsumata, et al., 1981 | LLK |
10.77 ± 0.01 | PE | Dewar, Shanshal, et al., 1969 | RDSH |
10.71 ± 0.05 | PI | Watanabe, Nakayama, et al., 1962 | RDSH |
De-protonation reactions
C3H6NO2- + =
By formula: C3H6NO2- + H+ = C3H7NO2
Quantity | Value | Units | Method | Reference | Comment |
---|---|---|---|---|---|
ΔrH° | 1490. ± 9.2 | kJ/mol | G+TS | Bartmess, Scott, et al., 1979 | gas phase; value altered from reference due to change in acidity scale; B |
ΔrH° | 1491. ± 12. | kJ/mol | G+TS | Cumming and Kebarle, 1978 | gas phase; B |
Quantity | Value | Units | Method | Reference | Comment |
ΔrG° | 1464. ± 8.4 | kJ/mol | IMRE | Bartmess, Scott, et al., 1979 | gas phase; value altered from reference due to change in acidity scale; B |
ΔrG° | 1466. ± 8.4 | kJ/mol | IMRE | Cumming and Kebarle, 1978 | gas phase; B |

Kovats' RI, non-polar column, isothermal

Column type | Active phase | Temperature (C) | I | Reference | Comment |
---|---|---|---|---|---|
Capillary | SPB-1 | 60. | 631. | Castello, Vezzani, et al., 1991 | N2; Column length: 60. m; Column diameter: 0.75 mm |
Packed | SE-30 | 100. | 676. | Winskowski, 1983 | Gaschrom Q; Column length: 2. m |
Packed | SF-96 | 100. | 686. | Boneva and Dimov, 1979 | N2; Column length: 2. m |
Packed | SF-96 | 110. | 686. | Boneva and Dimov, 1979 | N2; Column length: 2. m |
Packed | SF-96 | 90. | 683. | Boneva and Dimov, 1979 | N2; Column length: 2. m |

Kovats' RI, polar column, isothermal

Column type | Active phase | Temperature (C) | I | Reference | Comment |
---|---|---|---|---|---|
Capillary | Supelcowax-10 | 60. | 1129. | Castello, Vezzani, et al., 1991 | N2; Column length: 60. m; Column diameter: 0.75 mm |

Normal alkane RI, non-polar column, custom temperature program

Column type | Active phase | I | Reference | Comment |
---|---|---|---|---|
Capillary | SPB-1 | 672. | Flanagan, Streete, et al., 1997 | 60. m/0.53 mm/5. μm, He; Program: 40C(6min) => 5C/min => 80C => 10C/min => 200C |
Capillary | SPB-1 | 672. | Strete, Ruprah, et al., 1992 | 60. m/0.53 mm/5.0 μm, Helium; Program: 40 0C (6 min) 5 0C/min -> 80 0C 10 0C/min -> 200 0C |
Capillary | SPB-1 | 685. | Strete, Ruprah, et al., 1992 | 60. m/0.53 mm/5.0 μm, Helium; Program: not specified |
Capillary | DB-1 | 660. | Buttery, Teranishi, et al., 1990 | Column length: 60. m; Column diameter: 0.32 mm; Program: not specified |
Capillary | OV-1, SE-30, Methyl silicone, SP-2100, OV-101, DB-1, etc. | 676. | Waggott and Davies, 1984 | Hydrogen; Column length: 50. m; Column diameter: 0.32 mm; Program: not specified |
Capillary | OV-1 | 685. | Ramsey and Flanagan, 1982 | Program: not specified |

Normal alkane RI, polar column, custom temperature program

Column type | Active phase | I | Reference | Comment |
---|---|---|---|---|
Capillary | Carbowax 20M | 1109. | Ramsey and Flanagan, 1982 | Program: not specified |

Henry's Law data

Data compiled by: Rolf Sander

Henry's Law constant (water solution)

kH(T) = H exp(d(ln(kH))/d(1/T) ((1/T) - 1/(298.15 K)))
H = Henry's law constant for solubility in water at 298.15 K (mol/(kg*bar))
d(ln(kH))/d(1/T) = Temperature dependence constant (K)

H (mol/(kg*bar)) d(ln(kH))/d(1/T) (K) Method Reference Comment
11. QN/A missing citation give several references for the Henry's law constants but don't assign them to specific species. Value at T = 293. K.
8.2 VN/A

References

Cass, Fletcher, et al., 1958
Cass, R.C.; Fletcher, S.E.; Mortimer, C.T.; Quincey, P.G.; Springall, H.D.,
Heats of combustion and molecular structure. Part IV. Aliphatic nitroalkanes and nitric esters,
J. Chem. Soc., 1958, 958-962. [all data]
Cox and Pilcher, 1970
Cox, J.D.; Pilcher, G.,
Thermochemistry of Organic and Organometallic Compounds, Academic Press, New York, 1970, 1-636. [all data]
Holcomb and Dorsey, 1949
Holcomb, D.E.; Dorsey, C.L., Jr.,
Thermodynamic properties of nitroparaffins,
Ind. Eng. Chem., 1949, 41, 2788-2792. [all data]
Weast and Grasselli, 1989
CRC Handbook of Data on Organic Compounds, 2nd Editon, Weast,R.C and Grasselli, J.G., ed(s)., CRC Press, Inc., Boca Raton, FL, 1989, 1. [all data]
Toops, 1956
Toops, E.E.,
Physical Properties of High Purity Nitroparaffins,
J. Phys. Chem., 1956, 60, 304-6. [all data]
Hodge, 1940
Hodge, E.B.,
Vapor pressures for six aliphatic nitro compounds,
Ind. Eng. Chem., 1940, 32, 748. [all data]
Chickos, Hosseini, et al., 1995
Chickos, James S.; Hosseini, Sarah; Hesse, Donald G.,
Determination of vaporization enthalpies of simple organic molecules by correlations of changes in gas chromatographic net retention times,
Thermochimica Acta, 1995, 249, 41-62, https://doi.org/10.1016/0040-6031(95)90670-3
. [all data]
Stephenson and Malanowski, 1987
Stephenson, Richard M.; Malanowski, Stanislaw,
Handbook of the Thermodynamics of Organic Compounds, 1987, https://doi.org/10.1007/978-94-009-3173-2
. [all data]
Stull, 1947
Stull, Daniel R.,
Vapor Pressure of Pure Substances. Organic and Inorganic Compounds,
Ind. Eng. Chem., 1947, 39, 4, 517-540, https://doi.org/10.1021/ie50448a022
. [all data]
Toops, 1956, 2
Toops, Emory E.,
Physical Properties of Eight High-Purity Nitroparaffins,
J. Phys. Chem., 1956, 60, 3, 304-306, https://doi.org/10.1021/j150537a012
. [all data]
Dykyj, 1970
Dykyj, J.,
Petrochemica, 1970, 10, 2, 51. [all data]
Bartmess, Scott, et al., 1979
Bartmess, J.E.; Scott, J.A.; McIver, R.T., Jr.,
The gas phase acidity scale from methanol to phenol,
J. Am. Chem. Soc., 1979, 101, 6047. [all data]
Cumming and Kebarle, 1978
Cumming, J.B.; Kebarle, P.,
Summary of gas phase measurements involving acids AH. Entropy changes in proton transfer reactions involving negative ions. Bond dissociation energies D(A-H) and electron affinities EA(A),
Can. J. Chem., 1978, 56, 1. [all data]
Kimura, Katsumata, et al., 1981
Kimura, K.; Katsumata, S.; Achiba, Y.; Yamazaki, T.; Iwata, S.,
Ionization energies, Ab initio assignments, and valence electronic structure for 200 molecules
in Handbook of HeI Photoelectron Spectra of Fundamental Organic Compounds, Japan Scientific Soc. Press, Tokyo, 1981. [all data]
Dewar, Shanshal, et al., 1969
Dewar, M.J.S.; Shanshal, M.; Worley, S.D.,
Calculated and observed ionization potentials gf nitroalkanes and of nitrous and nitric acids and esters. Extension of the MINDO method to nitrogen-oxygen compounds,
J. Am. Chem. Soc., 1969, 91, 3590. [all data]
Watanabe, Nakayama, et al., 1962
Watanabe, K.; Nakayama, T.; Mottl, J.,
Ionization potentials of some molecules,
J. Quant. Spectry. Radiative Transfer, 1962, 2, 369. [all data]
Castello, Vezzani, et al., 1991
Castello, G.; Vezzani, S.; Gerbino, T.,
Gas chromatographic separation and automatic identification of complex mixtures of organic solvents in indrustrial wates,
J. Chromatogr., 1991, 585, 2, 273-280, https://doi.org/10.1016/0021-9673(91)85088-W
. [all data]
Winskowski, 1983
Winskowski, J.,
Gaschromatographische Identifizierung von Stoffen anhand von Indexziffem und unterschiedlichen Detektoren,
Chromatographia, 1983, 17, 3, 160-165, https://doi.org/10.1007/BF02271041
. [all data]
Boneva and Dimov, 1979
Boneva, S.; Dimov, N.,
Chromatographic retention indices of C1-C4 nitroparaffins,
Zh. Anal. Khim., 1979, 34, 6, 902-905. [all data]
Flanagan, Streete, et al., 1997
Flanagan, R.J.; Streete, P.J.; Ramsey, J.D.,
Volatile Substance Abuse, UNODC Technical Series, No 5, United Nations, Office on Drugs and Crime, Vienna International Centre, PO Box 500, A-1400 Vienna, Austria, 1997, 56, retrieved from http://www.odccp.org/pdf/technicalseries1997-01-011.pdf. [all data]
Strete, Ruprah, et al., 1992
Strete, P.J.; Ruprah, M.; Ramsey, J.D.; Flanagan, R.J.,
Detection and identification of volatile substances by headspace capillary gas chromatography to aid the diagnosis of acute poisoning,
Analyst, 1992, 117, 7, 1111-1127, https://doi.org/10.1039/an9921701111
. [all data]
Buttery, Teranishi, et al., 1990
Buttery, R.G.; Teranishi, R.; Flath, R.A.; Ling, L.C.,
Identification of additional tomato paste volatiles,
J. Agric. Food Chem., 1990, 38, 3, 792-795, https://doi.org/10.1021/jf00093a042
. [all data]
Waggott and Davies, 1984
Waggott, A.; Davies, I.W.,
Identification of organic pollutants using linear temperature programmed retention indices (LTPRIs) - Part II, 1984, retrieved from http://dwi.defra.gov.uk/research/completed-research/reports/dwi0383.pdf. [all data]
Ramsey and Flanagan, 1982
Ramsey, J.D.; Flanagan, R.J.,
Detection and Identification of Volatile Organic Compounds in Blood by Headspace Gas Chromatography as an Aid to the Diagnosis of Solvent Abuse,
J. Chromatogr., 1982, 240, 2, 423-444, https://doi.org/10.1016/S0021-9673(00)99622-5
. [all data]