Ethene, chlorotrifluoro-
- Formula: C2ClF3
- Molecular weight: 116.470
- IUPAC Standard InChIKey: UUAGAQFQZIEFAH-UHFFFAOYSA-N
- CAS Registry Number: 79-38-9
- Chemical structure:
View 3d structure (requires JavaScript / HTML 5) - Other names: Ethylene, chlorotrifluoro-; Chlorotrifluoroethene; Chlorotrifluoroethylene; CTFE; Genetron 1113; Monochlorotrifluoroethylene; Trifluorochloroethylene; Trifluoromonochloroethylene; Trifluorovinyl Chloride; Trithene; C2F3Cl; 1-Chloro-1,2,2-trifluoroethylene; 2-Chloro-1,1,2-trifluoroethylene; Chlortrifluoraethylen; Daiflon; Ethylene, trifluorochloro-; Fluoroplast 3; Trifluorchlorethylen; 1,1,2-Trifluoro-2-chloroethylene; UN 1082; 1-Chloro-1,2,2-trifluoroethene; Ethene, 1-chloro-1,2,2-trifluoro-

Gas phase thermochemistry data

Data compiled by: Hussein Y. Afeefy, Joel F. Liebman, and Stephen E. Stein
Quantity | Value | Units | Method | Reference | Comment |
---|---|---|---|---|---|
ΔfH°gas | -505.5 ± 4.7 | kJ/mol | Ccr | Erastov and Kolesov, 1982 | see Erastov, Kolesov, et al., 1981 AND Papina, Erastov, et al., 1981 |
ΔfH°gas | -564.8 ± 5.8 | kJ/mol | Cm | Kolesov, Zenkov, et al., 1963 | Reanalyzed by Cox and Pilcher, 1970, Original value = -544.8 ± 5.4 kJ/mol |
ΔfH°gas | -510. ± 13. | kJ/mol | Ccb | Wartenberg and Schiefer, 1955 | Reanalyzed by Cox and Pilcher, 1970, Original value = -502. kJ/mol |
ΔfH°gas | -527. ± 8. | kJ/mol | Cm | Kirkbride and Davidson, 1954 | Von Wartenberg method |

Condensed phase thermochemistry data

Data compiled as indicated in comments:
ALS - Hussein Y. Afeefy, Joel F. Liebman, and Stephen E. Stein
DH - Eugene S. Domalski and Elizabeth D. Hearing
Quantity | Value | Units | Method | Reference | Comment |
---|---|---|---|---|---|
ΔfH°liquid | -522.7 ± 4.7 | kJ/mol | Ccr | Erastov and Kolesov, 1982 | see Erastov, Kolesov, et al., 1981 AND Papina, Erastov, et al., 1981; ALS |
Quantity | Value | Units | Method | Reference | Comment |
ΔcH°liquid | -816.0 ± 2.8 | kJ/mol | Ccr | Erastov and Kolesov, 1982 | see Erastov, Kolesov, et al., 1981 AND Papina, Erastov, et al., 1981; ALS |
Quantity | Value | Units | Method | Reference | Comment |
S°liquid | 220.66 | J/mol*K | N/A | Oliver, Grisard, et al., 1951 | DH |
Constant pressure heat capacity of liquid
Cp,liquid (J/mol*K) | Temperature (K) | Reference | Comment |
---|---|---|---|
122.42 | 244.80 | Oliver, Grisard, et al., 1951 | T = 16 to 245 K.; DH |

Phase change data

Data compiled as indicated in comments:
BS - Robert L. Brown and Stephen E. Stein
TRC - Thermodynamics Research Center, NIST Boulder Laboratories, Chris Muzny director
ALS - Hussein Y. Afeefy, Joel F. Liebman, and Stephen E. Stein
AC - William E. Acree, Jr., James S. Chickos
DH - Eugene S. Domalski and Elizabeth D. Hearing
Quantity | Value | Units | Method | Reference | Comment |
---|---|---|---|---|---|
Tboil | 244.8 | K | N/A | Aldrich Chemical Company Inc., 1990 | BS |
Tboil | 246. | K | N/A | PCR Inc., 1990 | BS |
Quantity | Value | Units | Method | Reference | Comment |
Tfus | 118.3 | K | N/A | Golovanova and Kolesov, 1984 | Uncertainty assigned by TRC = 0.2 K; TRC |
Quantity | Value | Units | Method | Reference | Comment |
Ttriple | 115.00 | K | N/A | Oliver, Grisard, et al., 1951, 2 | Uncertainty assigned by TRC = 0.05 K; from melting curve in a calorimeter, To = 273.16 K; TRC |
Quantity | Value | Units | Method | Reference | Comment |
Tc | 379.5 ± 0.8 | K | AVG | N/A | Average of 6 values; Individual data points |
Quantity | Value | Units | Method | Reference | Comment |
Pc | 260. ± 200. | bar | AVG | N/A | Average of 6 values; Individual data points |
Quantity | Value | Units | Method | Reference | Comment |
ρc | 4.72 | mol/l | N/A | Oliver, Grisard, et al., 1951, 2 | Uncertainty assigned by TRC = 0.26 mol/l; mean value for 5 samples; TRC |
Quantity | Value | Units | Method | Reference | Comment |
ΔvapH° | 17.2 | kJ/mol | V | Erastov and Kolesov, 1982 | see Erastov, Kolesov, et al., 1981 AND Papina, Erastov, et al., 1981; ALS |
Enthalpy of vaporization
ΔvapH (kJ/mol) | Temperature (K) | Method | Reference | Comment |
---|---|---|---|---|
21.8 | 247. | A | Stephenson and Malanowski, 1987 | Based on data from 206. to 262. K.; AC |
20.2 | 313. | A | Stephenson and Malanowski, 1987 | Based on data from 298. to 379. K.; AC |
21.7 | 248. | N/A | McCullough, Person, et al., 1951 | Based on data from 206. to 263. K.; AC |
21.9 | 235. | N/A | Heisig and Hurd, 1933 | Based on data from 195. to 250. K.; AC |
Antoine Equation Parameters
log10(P) = A − (B / (T + C))
P = vapor pressure (bar)
T = temperature (K)
View plot Requires a JavaScript / HTML 5 canvas capable browser.
Temperature (K) | A | B | C | Reference | Comment |
---|---|---|---|---|---|
206.33 to 262.28 | 4.02636 | 850.498 | -33.246 | Oliver, Grisard, et al., 1951 | Coefficents calculated by NIST from author's data. |
Enthalpy of fusion
ΔfusH (kJ/mol) | Temperature (K) | Reference | Comment |
---|---|---|---|
5.282 | 118.3 | Golovanova and Kolesov, 1984, 2 | DH |
5.5526 | 115.0 | Oliver, Grisard, et al., 1951 | DH |
5.55 | 115. | Domalski and Hearing, 1996 | AC |
Entropy of fusion
ΔfusS (J/mol*K) | Temperature (K) | Reference | Comment |
---|---|---|---|
44.6 | 118.3 | Golovanova and Kolesov, 1984, 2 | DH |
48.28 | 115.0 | Oliver, Grisard, et al., 1951 | DH |

Reaction thermochemistry data

Data compiled by: Hussein Y. Afeefy, Joel F. Liebman, and Stephen E. Stein
Individual Reactions
By formula: 4Na + C2ClF3 = 2C + ClNa + 3FNa
Quantity | Value | Units | Method | Reference | Comment |
---|---|---|---|---|---|
ΔrH° | -1576.1 ± 5.4 | kJ/mol | Cm | Kolesov, Zenkov, et al., 1963 | gas phase; Reanalyzed by Cox and Pilcher, 1970, Original value = -1543. ± 5.4 kJ/mol |
By formula: 2H2 + C2ClF3 = C2H3F3 + HCl
Quantity | Value | Units | Method | Reference | Comment |
---|---|---|---|---|---|
ΔrH° | -267.7 ± 2.1 | kJ/mol | Chyd | Lacher, Kianpour, et al., 1956 | gas phase; Reanalyzed by Cox and Pilcher, 1970, Original value = -271.6 kJ/mol; At 410 K |
By formula: HBr + C2ClF3 = C2HBrClF3
Quantity | Value | Units | Method | Reference | Comment |
---|---|---|---|---|---|
ΔrH° | -109.09 ± 0.95 | kJ/mol | Cm | Lacher, Lea, et al., 1950 | gas phase; Heat of hydrobromination at 367°K |
By formula: Cl2 + C2ClF3 = C2Cl3F3
Quantity | Value | Units | Method | Reference | Comment |
---|---|---|---|---|---|
ΔrH° | -204.2 ± 2.0 | kJ/mol | Cm | Lacher, McKinley, et al., 1949 | gas phase; Heat of Chlorination at 363 °K |
By formula: Br2 + C2ClF3 = C2Br2ClF3
Quantity | Value | Units | Method | Reference | Comment |
---|---|---|---|---|---|
ΔrH° | -132.3 | kJ/mol | Cm | Lacher, Casali, et al., 1956 | gas phase; Heat of bromination |
By formula: C2Br2ClF3 = Br2 + C2ClF3
Quantity | Value | Units | Method | Reference | Comment |
---|---|---|---|---|---|
ΔrH° | 132.25 | kJ/mol | Cm | Lacher, Casali, et al., 1956 | gas phase |

Gas phase ion energetics data

Data evaluated as indicated in comments:
L - Sharon G. Lias
Data compiled as indicated in comments:
LLK - Sharon G. Lias, Rhoda D. Levin, and Sherif A. Kafafi
RDSH - Henry M. Rosenstock, Keith Draxl, Bruce W. Steiner, and John T. Herron
Quantity | Value | Units | Method | Reference | Comment |
---|---|---|---|---|---|
IE (evaluated) | 9.81 ± 0.03 | eV | N/A | N/A | L |
Ionization energy determinations
IE (eV) | Method | Reference | Comment |
---|---|---|---|
10.6 ± 0.1 | EI | Syrvatka, Gil'burd, et al., 1972 | LLK |
9.76 | S | Scott and Russell, 1972 | LLK |
9.82 | PE | Cullen, Frost, et al., 1972 | LLK |
9.84 | PE | Lake and Thompson, 1970 | RDSH |
10.26 | PE | Wittel and Bock, 1974 | Vertical value; LLK |
Appearance energy determinations
Ion | AE (eV) | Other Products | Method | Reference | Comment |
---|---|---|---|---|---|
CCl+ | 16.9 ± 0.1 | CF3 | EI | Syrvatka, Gil'burd, et al., 1972 | LLK |
CClF+ | 14.9 ± 0.1 | CF | EI | Syrvatka, Gil'burd, et al., 1972 | LLK |
CFCl+ | 15.0 ± 0.1 | CF2 | EI | Syrvatka, Bel'ferman, et al., 1971 | LLK |
CF+ | 16.7 ± 0.1 | CClF2 | EI | Syrvatka, Gil'burd, et al., 1972 | LLK |
C2ClF2+ | 15.9 ± 0.2 | F | EI | Syrvatka, Gil'burd, et al., 1972 | LLK |
C2F3+ | 15.4 ± 0.1 | Cl | EI | Syrvatka, Gil'burd, et al., 1972 | LLK |

Normal alkane RI, non-polar column, custom temperature program

Column type | Active phase | I | Reference | Comment |
---|---|---|---|---|
Capillary | Porapack Q | 294. | Zenkevich and Rodin, 2004 | Program: not specified |

References

Erastov and Kolesov, 1982
Erastov, P.A.; Kolesov, V.P.,
Enthalpy of formation of trifluorochloroethene,
J. Chem. Thermodyn., 1982, 14, 103-106. [all data]
Erastov, Kolesov, et al., 1981
Erastov, P.A.; Kolesov, V.P.; Dityateva, L.N.; Golovanova, Yu.G.,
The enthalpy of formation of 1,1,2-trifluoro-1,2,2-trichloroethane,
J. Chem. Thermodyn., 1981, 13, 663-669. [all data]
Papina, Erastov, et al., 1981
Papina, T.S.; Erastov, P.A.; Kolesov, V.P.,
The enthalpies of formation of 1,1,1-trifluoro-2-chloro-2-bromoethane and 1,1,2-trifluoro-2-chloro-1-bromoethane,
J. Chem. Thermodyn., 1981, 13, 683-689. [all data]
Kolesov, Zenkov, et al., 1963
Kolesov, V.P.; Zenkov, I.D.; Skuratov, S.M.,
Standard enthalpy of formation of chlorotrifluoroethylene,
Russ. J. Phys. Chem. (Engl. Transl.), 1963, 37, 115-116. [all data]
Cox and Pilcher, 1970
Cox, J.D.; Pilcher, G.,
Thermochemistry of Organic and Organometallic Compounds, Academic Press, New York, 1970, 1-636. [all data]
Wartenberg and Schiefer, 1955
Wartenberg, H.V.; Schiefer, J.,
Bildungswarmen von fluor-chlor-kohlenstoff-verbindungen,
Z. Anorg. Chem., 1955, 278, 326-332. [all data]
Kirkbride and Davidson, 1954
Kirkbride, F.W.; Davidson, F.G.,
Heats of formation of gaseous fluoro- and fluorochloro-carbons,
Nature (London), 1954, 174, 79-80. [all data]
Oliver, Grisard, et al., 1951
Oliver, G.D.; Grisard, J.W.; Cunningham, C.W.,
Thermodynamic properties and P-V-T relations of chlorotrifluoroethylene,
J. Am. Chem. Soc., 1951, 73, 5719-5722. [all data]
Aldrich Chemical Company Inc., 1990
Aldrich Chemical Company Inc.,
Catalog Handbook of Fine Chemicals, Aldrich Chemical Company, Inc., Milwaukee WI, 1990, 1. [all data]
PCR Inc., 1990
PCR Inc.,
Research Chemicals Catalog 1990-1991, PCR Inc., Gainesville, FL, 1990, 1. [all data]
Golovanova and Kolesov, 1984
Golovanova, Y.G.; Kolesov, V.P.,
Enthalpies of melting, melting temperatures, and cryoscopic constants of some haloorganic compounds,
Vestn. Mosk. Univ., Ser. 2: Khim., 1984, 25, 244. [all data]
Oliver, Grisard, et al., 1951, 2
Oliver, G.D.; Grisard, J.W.; Cunningham, C.W.,
Thermodynamic Properties and P-V-T Relations of Chlorotrifluoroethylene.,
J. Am. Chem. Soc., 1951, 73, 5719-22. [all data]
Stephenson and Malanowski, 1987
Stephenson, Richard M.; Malanowski, Stanislaw,
Handbook of the Thermodynamics of Organic Compounds, 1987, https://doi.org/10.1007/978-94-009-3173-2
. [all data]
McCullough, Person, et al., 1951
McCullough, J.P.; Person, W.B.; Spitzer, Ralph,
The Heats of Vaporization and Vapor Heat Capacities of Some Dimethylcyclohexanes 1,
J. Am. Chem. Soc., 1951, 73, 9, 4069-4071, https://doi.org/10.1021/ja01153a003
. [all data]
Heisig and Hurd, 1933
Heisig, G.B.; Hurd, Charles D.,
Vapor Pressure and Boiling Point of Pure Methylacetylene *,
J. Am. Chem. Soc., 1933, 55, 8, 3485-3487, https://doi.org/10.1021/ja01335a083
. [all data]
Golovanova and Kolesov, 1984, 2
Golovanova, Yu.G.; Kolesov, V.P.,
Enthalpies of melting, melting temperatures, and cryoscopic constants of some haloorganic compounds, Vestn. Mosk Univ.,
Ser. 2: Khim., 1984, 25(3), 244-248. [all data]
Domalski and Hearing, 1996
Domalski, Eugene S.; Hearing, Elizabeth D.,
Heat Capacities and Entropies of Organic Compounds in the Condensed Phase. Volume III,
J. Phys. Chem. Ref. Data, 1996, 25, 1, 1, https://doi.org/10.1063/1.555985
. [all data]
Lacher, Kianpour, et al., 1956
Lacher, J.R.; Kianpour, A.; Oetting, F.; Park, J.D.,
Reaction calorimetry. The hydrogenation of organic fluorides and chlorides,
Trans. Faraday Soc., 1956, 52, 1500-1508. [all data]
Lacher, Lea, et al., 1950
Lacher, J.R.; Lea, K.R.; Walden, C.H.; Olson, G.G.; Park, J.D.,
Reaction heats of organic fluorine compounds. III. The vapor phase heats of hydrobromination of some simple fluoroolefins,
J. Am. Chem. Soc., 1950, 72, 3231-3234. [all data]
Lacher, McKinley, et al., 1949
Lacher, J.R.; McKinley, J.J.; Walden, C.; Lea, K.; Park, J.D.,
Reaction heats of organic fluorine compounds. II. The vapor phase heats of chlorination of some simple fluoroolefins,
J. Am. Chem. Soc., 1949, 71, 1334-1337. [all data]
Lacher, Casali, et al., 1956
Lacher, J.R.; Casali, L.; Park, J.D.,
Reaction heats of organic halogen compounds V. The vapor phase bromination of tetrafluoroethylene and trifluorochloroethylene,
J. Phys. Chem., 1956, 60, 608-610. [all data]
Syrvatka, Gil'burd, et al., 1972
Syrvatka, B.G.; Gil'burd, M.M.; Bel'ferman, A.L.,
Mass spectrometric study of chlorofluoro-substituted ethylenes,
J. Org. Chem. USSR, 1972, 8, 1587, In original 1553. [all data]
Scott and Russell, 1972
Scott, J.D.; Russell, B.R.,
Vacuum-ultraviolet spectral studies of several chlorofluoroethylenes,
J. Am. Chem. Soc., 1972, 94, 2634. [all data]
Cullen, Frost, et al., 1972
Cullen, W.R.; Frost, D.C.; Leeder, W.R.,
The ultraviolet and photoelectron spectra of some unsaturated fluorocarbon derivatives,
J. Fluorine Chem., 1972, 1, 227. [all data]
Lake and Thompson, 1970
Lake, R.F.; Thompson, H.,
Photoelectron spectra of halogenated ethylenes,
Proc. Roy. Soc. (London), 1970, A315, 323. [all data]
Wittel and Bock, 1974
Wittel, K.; Bock, H.,
Photoelektronenspekten und molekuleigenschaften. XXVII. Chlor- und bromathylene- beispiele fur anderungen in π- und σ-Systemen,
Chem. Ber., 1974, 107, 317. [all data]
Syrvatka, Bel'ferman, et al., 1971
Syrvatka, B.G.; Bel'ferman, A.L.; Gil'burd, M.M.; Moin, F.B.,
Determination of the dissociation energy of the double bond in some fluorochloro-substituted ethylenes and their ions by electron bombardment,
J. Org. Chem. USSR, 1971, 7, 8, In original 9. [all data]
Lacher and Park, 1950
Lacher, J.R.; Park, J.D.,
J. Am. Chem. Soc., 1950, 72, 5486. [all data]
Zenkevich and Rodin, 2004
Zenkevich, I.G.; Rodin, A.A.,
Gas chromatographic identification of some volatile toxic fluorine containing compounds by precalculated retention indices,
J. Ecol. Chem. (Rus.), 2004, 13, 1, 22-28. [all data]