Acetyl chloride, dichloro-
- Formula: C2HCl3O
- Molecular weight: 147.388
- IUPAC Standard InChIKey: FBCCMZVIWNDFMO-UHFFFAOYSA-N
- CAS Registry Number: 79-36-7
- Chemical structure:

Gas phase thermochemistry data

Data compiled by: Hussein Y. Afeefy, Joel F. Liebman, and Stephen E. Stein
Quantity | Value | Units | Method | Reference | Comment |
---|---|---|---|---|---|
ΔfH°gas | -241. ± 8.8 | kJ/mol | Cm | Pritchard and Skinner, 1950 | Reanalyzed by Cox and Pilcher, 1970, Original value = -254. kJ/mol; Heat of hydrolysis at 298 K |

Condensed phase thermochemistry data

Data compiled by: Hussein Y. Afeefy, Joel F. Liebman, and Stephen E. Stein
Quantity | Value | Units | Method | Reference | Comment |
---|---|---|---|---|---|
ΔfH°liquid | -281. ± 8.4 | kJ/mol | Cm | Pritchard and Skinner, 1950 | Reanalyzed by Cox and Pilcher, 1970, Original value = -287.6 kJ/mol; Heat of hydrolysis at 298 K |

Phase change data

Data compiled as indicated in comments:
BS - Robert L. Brown and Stephen E. Stein
TRC - Thermodynamics Research Center, NIST Boulder Laboratories, Chris Muzny director
Quantity | Value | Units | Method | Reference | Comment |
---|---|---|---|---|---|
Tboil | 380.7 | K | N/A | Aldrich Chemical Company Inc., 1990 | BS |
Tboil | 382.2 | K | N/A | Weast and Grasselli, 1989 | BS |
Tboil | 378. | K | N/A | Parrot, Hervien, et al., 1964 | Uncertainty assigned by TRC = 3. K; TRC |
Tboil | 381.2 | K | N/A | Euranto and Kujanpaa, 1961 | Uncertainty assigned by TRC = 1. K; TRC |
Tboil | 381. | K | N/A | Branch and Nixon, 1936 | Uncertainty assigned by TRC = 3. K; TRC |

Reaction thermochemistry data

Data compiled by: Hussein Y. Afeefy, Joel F. Liebman, and Stephen E. Stein
Individual Reactions
By formula: H2O + C2HCl3O = HCl + C2H2Cl2O2
Quantity | Value | Units | Method | Reference | Comment |
---|---|---|---|---|---|
ΔrH° | -107.7 | kJ/mol | Cm | Pritchard and Skinner, 1950 | liquid phase; Heat of hydrolysis at 298 K |

Gas phase ion energetics data

Data compiled by: Sharon G. Lias, Rhoda D. Levin, and Sherif A. Kafafi
Ionization energy determinations
IE (eV) | Method | Reference | Comment |
---|---|---|---|
11.0 | PE | Katsumata and Kimura, 1975 | |
11.27 | PE | Katsumata and Kimura, 1975 | Vertical value |

Normal alkane RI, non-polar column, custom temperature program

Column type | Active phase | I | Reference | Comment |
---|---|---|---|---|
Capillary | Polydimethyl siloxanes | 726. | Zenkevich, 2001 | Program: not specified |

References

Pritchard and Skinner, 1950
Pritchard, H.O.; Skinner, H.A.,
The heats of hydrolysis of the chloro-substituted acetyl chlorides,
J. Chem. Soc., 1950, 272-276. [all data]
Cox and Pilcher, 1970
Cox, J.D.; Pilcher, G.,
Thermochemistry of Organic and Organometallic Compounds, Academic Press, New York, 1970, 1-636. [all data]
Aldrich Chemical Company Inc., 1990
Aldrich Chemical Company Inc.,
Catalog Handbook of Fine Chemicals, Aldrich Chemical Company, Inc., Milwaukee WI, 1990, 1. [all data]
Weast and Grasselli, 1989
CRC Handbook of Data on Organic Compounds, 2nd Editon, Weast,R.C and Grasselli, J.G., ed(s)., CRC Press, Inc., Boca Raton, FL, 1989, 1. [all data]
Parrot, Hervien, et al., 1964
Parrot, J.; Hervien, J.; Ursy, Y.; Paty, M.,
Preparation and Properties of the N-(chloro and bromoacetyl)-piperdines,
Bull. Soc. Chim. Fr., 1964, 1964, 1063-9. [all data]
Euranto and Kujanpaa, 1961
Euranto, E.; Kujanpaa, T.,
The Preparation of α-Halo-sec-alkyl Esters of Aliphatic Acids,
Acta Chem. Scand., 1961, 15, 1209-14. [all data]
Branch and Nixon, 1936
Branch, G.E.K.; Nixon, A.C.,
The Rate of Alcoholysis of Acyl Chlorides,
J. Am. Chem. Soc., 1936, 58, 2499-2504. [all data]
Katsumata and Kimura, 1975
Katsumata, S.; Kimura, K.,
Photoelectron spectra and sum rule consideration. Effect of chlorine substitution on ionization energies for chloroethanes, chloroacetaldehydes and chloroacetyl chlorides,
J. Electron Spectrosc. Relat. Phenom., 1975, 6, 309. [all data]
Zenkevich, 2001
Zenkevich, I.G.,
Encyclopedia of Chromatography. Derivatization of Amines, Amino Acids, Amides and Imides for GC Analysis, Marcel Dekker, Inc, New York - Basel, 2001, 224. [all data]