[1,1'-Biphenyl]-4,4'-dicarboxylic acid, dimethyl ester
- Formula: C16H14O4
- Molecular weight: 270.2800
- IUPAC Standard InChIKey: BKRIRZXWWALTPU-UHFFFAOYSA-N
- CAS Registry Number: 792-74-5
- Chemical structure:
View 3d structure (requires JavaScript / HTML 5) - Other names: 4,4'-Biphenyldicarboxylic acid, dimethyl ester; Dimethyl 4,4'-biphenyldicarboxylate; Dimethyl biphenyl-4,4'-dicarboxylate; 4,4-Dicarboxymethylbiphenyl; 4,4'-Bis(methoxycarbonyl)biphenyl; Dimethyl (1,1'-biphenyl)-4,4'-dicarboxylate

Gas phase ion energetics data

Data compiled by: Sharon G. Lias, Rhoda D. Levin, and Sherif A. Kafafi
Ionization energy determinations
IE (eV) | Method | Reference |
---|---|---|
9.15 ± 0.05 | EI | Loudon and Mazengo, 1974 |

References

Loudon and Mazengo, 1974
Loudon, A.G.; Mazengo, R.Z.,
Steric strain and electron-impact. The behaviour of some n, n'-dimethyl- 1,1-binaphthyls, some n, n'-dimethylbiphenyls and model compounds,
Org. Mass Spectrom., 1974, 8, 179. [all data]