Ethane, nitro-
- Formula: C2H5NO2
- Molecular weight: 75.0666
- IUPAC Standard InChIKey: MCSAJNNLRCFZED-UHFFFAOYSA-N
- CAS Registry Number: 79-24-3
- Chemical structure:
View 3d structure (requires JavaScript / HTML 5) - Other names: Nitroethane; C2H5NO2; Nitroetan; UN 2842; NE; Nitroparaffin

Condensed phase thermochemistry data

Data compiled as indicated in comments:
ALS - Hussein Y. Afeefy, Joel F. Liebman, and Stephen E. Stein
DH - Eugene S. Domalski and Elizabeth D. Hearing
Quantity | Value | Units | Method | Reference | Comment |
---|---|---|---|---|---|
ΔfH°liquid | -144. ± 0.4 | kJ/mol | Ccb | Lebedeva and Ryadenko, 1973 | ALS |
ΔfH°liquid | -143.6 ± 1.1 | kJ/mol | Ccb | Cass, Fletcher, et al., 1958 | Reanalyzed by Cox and Pilcher, 1970, Original value = -135. ± 1. kJ/mol; ALS |
ΔfH°liquid | -140.1 ± 1.3 | kJ/mol | Ccb | Holcomb and Dorsey, 1949 | ALS |
Quantity | Value | Units | Method | Reference | Comment |
ΔcH°liquid | -1358. ± 0.4 | kJ/mol | Ccb | Lebedeva and Ryadenko, 1973 | ALS |
ΔcH°liquid | -1358.0 ± 1.0 | kJ/mol | Ccb | Cass, Fletcher, et al., 1958 | Reanalyzed by Cox and Pilcher, 1970, Original value = -1366. ± 1. kJ/mol; ALS |
ΔcH°liquid | -1361.6 ± 1.3 | kJ/mol | Ccb | Holcomb and Dorsey, 1949 | ALS |
Constant pressure heat capacity of liquid
Cp,liquid (J/mol*K) | Temperature (K) | Reference | Comment |
---|---|---|---|
134.22 | 298.15 | Liu and Ziegler, 1966 | T = 80 to 300 K.; DH |

Phase change data

Data compiled as indicated in comments:
BS - Robert L. Brown and Stephen E. Stein
TRC - Thermodynamics Research Center, NIST Boulder Laboratories, Chris Muzny director
ALS - Hussein Y. Afeefy, Joel F. Liebman, and Stephen E. Stein
AC - William E. Acree, Jr., James S. Chickos
DH - Eugene S. Domalski and Elizabeth D. Hearing
Quantity | Value | Units | Method | Reference | Comment |
---|---|---|---|---|---|
Tboil | 387.6 ± 0.8 | K | AVG | N/A | Average of 6 values; Individual data points |
Quantity | Value | Units | Method | Reference | Comment |
Tfus | 183.63 | K | N/A | Toops, 1956 | Uncertainty assigned by TRC = 0.05 K; TRC |
Quantity | Value | Units | Method | Reference | Comment |
Ttriple | 183.69 | K | N/A | Liu and Ziegler, 1966 | Uncertainty assigned by TRC = 0.04 K; based on analysis of melting curve; TRC |
Quantity | Value | Units | Method | Reference | Comment |
ΔvapH° | 41.6 ± 0.42 | kJ/mol | V | Holcomb and Dorsey, 1949 | ALS |
Enthalpy of vaporization
ΔvapH (kJ/mol) | Temperature (K) | Method | Reference | Comment |
---|---|---|---|---|
38.6 | 339. | EB | Stephenson and Malanowski, 1987 | Based on data from 324. to 388. K. See also Toops, 1956, 2 and Dykyj, 1970.; AC |
41.3 | 267. | N/A | Stull, 1947 | Based on data from 252. to 387. K.; AC |
Antoine Equation Parameters
log10(P) = A − (B / (T + C))
P = vapor pressure (bar)
T = temperature (K)
View plot Requires a JavaScript / HTML 5 canvas capable browser.
Temperature (K) | A | B | C | Reference | Comment |
---|---|---|---|---|---|
390.0 to 459. | 1.74671 | 207.774 | -269.20 | Tolstova, Kogan, et al., 1965 | Coefficents calculated by NIST from author's data. |
252. to 387. | 4.71267 | 1671.266 | -31.963 | Stull, 1947 | Coefficents calculated by NIST from author's data. |
Enthalpy of fusion
ΔfusH (kJ/mol) | Temperature (K) | Reference | Comment |
---|---|---|---|
9.853 | 183.69 | Liu and Ziegler, 1966 | DH |
9.85 | 183.7 | Domalski and Hearing, 1996 | AC |
Entropy of fusion
ΔfusS (J/mol*K) | Temperature (K) | Reference | Comment |
---|---|---|---|
53.64 | 183.69 | Liu and Ziegler, 1966 | DH |

Reaction thermochemistry data

Data compiled as indicated in comments:
B - John E. Bartmess
M - Michael M. Meot-Ner (Mautner) and Sharon G. Lias
Individual Reactions
C2H4NO2- + =
By formula: C2H4NO2- + H+ = C2H5NO2
Quantity | Value | Units | Method | Reference | Comment |
---|---|---|---|---|---|
ΔrH° | 1489. ± 9.2 | kJ/mol | G+TS | Bartmess, Scott, et al., 1979 | gas phase; value altered from reference due to change in acidity scale; B |
ΔrH° | 1496. ± 12. | kJ/mol | G+TS | Cumming and Kebarle, 1978 | gas phase; B |
Quantity | Value | Units | Method | Reference | Comment |
ΔrG° | 1462. ± 8.4 | kJ/mol | IMRE | Bartmess, Scott, et al., 1979 | gas phase; value altered from reference due to change in acidity scale; B |
ΔrG° | 1469. ± 8.4 | kJ/mol | IMRE | Cumming and Kebarle, 1978 | gas phase; B |
CAS Reg. No. 34533-65-8 + 2 = C6H15N3O6-
By formula: CAS Reg. No. 34533-65-8 + 2C2H5NO2 = C6H15N3O6-
Quantity | Value | Units | Method | Reference | Comment |
---|---|---|---|---|---|
ΔrH° | 61.09 ± 0.84 | kJ/mol | TDAs | Wincel, 2004 | gas phase; B |
Quantity | Value | Units | Method | Reference | Comment |
ΔrG° | 26.4 | kJ/mol | TDAs | Wincel, 2004 | gas phase; B |
+
= C2H5N2O4-
By formula: NO2- + C2H5NO2 = C2H5N2O4-
Quantity | Value | Units | Method | Reference | Comment |
---|---|---|---|---|---|
ΔrH° | 66.1 ± 2.1 | kJ/mol | TDAs | Wincel, 2004 | gas phase; B |
Quantity | Value | Units | Method | Reference | Comment |
ΔrG° | 37.2 | kJ/mol | TDAs | Wincel, 2004 | gas phase; B |
C2H5N2O4- + 2 = C4H10N3O6-
By formula: C2H5N2O4- + 2C2H5NO2 = C4H10N3O6-
Quantity | Value | Units | Method | Reference | Comment |
---|---|---|---|---|---|
ΔrH° | 62.3 ± 2.1 | kJ/mol | TDAs | Wincel, 2004 | gas phase; B |
Quantity | Value | Units | Method | Reference | Comment |
ΔrG° | 28.5 | kJ/mol | TDAs | Wincel, 2004 | gas phase; B |
C4H10N3O6- + 3 = C6H15N4O8-
By formula: C4H10N3O6- + 3C2H5NO2 = C6H15N4O8-
Quantity | Value | Units | Method | Reference | Comment |
---|---|---|---|---|---|
ΔrH° | 49.4 ± 2.1 | kJ/mol | TDAs | Wincel, 2004 | gas phase; B |
Quantity | Value | Units | Method | Reference | Comment |
ΔrG° | 16.7 | kJ/mol | TDAs | Wincel, 2004 | gas phase; B |
C6H15N4O8- + 4 = C8H20N5O10-
By formula: C6H15N4O8- + 4C2H5NO2 = C8H20N5O10-
Quantity | Value | Units | Method | Reference | Comment |
---|---|---|---|---|---|
ΔrH° | 46.0 ± 2.1 | kJ/mol | TDAs | Wincel, 2004 | gas phase; B |
Quantity | Value | Units | Method | Reference | Comment |
ΔrG° | 11.3 | kJ/mol | TDAs | Wincel, 2004 | gas phase; B |
C6H15N3O6- + 3 = C8H20N4O8-
By formula: C6H15N3O6- + 3C2H5NO2 = C8H20N4O8-
Quantity | Value | Units | Method | Reference | Comment |
---|---|---|---|---|---|
ΔrH° | 56.9 ± 1.3 | kJ/mol | TDAs | Wincel, 2004 | gas phase; B |
Quantity | Value | Units | Method | Reference | Comment |
ΔrG° | 19.7 | kJ/mol | TDAs | Wincel, 2004 | gas phase; B |
C8H20N4O8- + 4 = C10H25N5O10-
By formula: C8H20N4O8- + 4C2H5NO2 = C10H25N5O10-
Quantity | Value | Units | Method | Reference | Comment |
---|---|---|---|---|---|
ΔrH° | 49.8 ± 2.1 | kJ/mol | TDAs | Wincel, 2004 | gas phase; B |
Quantity | Value | Units | Method | Reference | Comment |
ΔrG° | 8.79 | kJ/mol | TDAs | Wincel, 2004 | gas phase; B |
C4H10N2O6- + 2 = C6H15N3O8-
By formula: C4H10N2O6- + 2C2H5NO2 = C6H15N3O8-
Quantity | Value | Units | Method | Reference | Comment |
---|---|---|---|---|---|
ΔrH° | 53.1 ± 2.1 | kJ/mol | TDAs | Wincel, 2004 | gas phase; B |
Quantity | Value | Units | Method | Reference | Comment |
ΔrG° | 18.4 | kJ/mol | TDAs | Wincel, 2004 | gas phase; B |
C6H15N3O8- + 3 = C8H20N4O10-
By formula: C6H15N3O8- + 3C2H5NO2 = C8H20N4O10-
Quantity | Value | Units | Method | Reference | Comment |
---|---|---|---|---|---|
ΔrH° | 47.3 ± 2.1 | kJ/mol | TDAs | Wincel, 2004 | gas phase; B |
Quantity | Value | Units | Method | Reference | Comment |
ΔrG° | 10.0 | kJ/mol | TDAs | Wincel, 2004 | gas phase; B |
C8H20N4O10- + 4 = C10H25N5O12-
By formula: C8H20N4O10- + 4C2H5NO2 = C10H25N5O12-
Quantity | Value | Units | Method | Reference | Comment |
---|---|---|---|---|---|
ΔrH° | 43.9 ± 2.1 | kJ/mol | TDAs | Wincel, 2004 | gas phase; B |
Quantity | Value | Units | Method | Reference | Comment |
ΔrG° | 2.9 | kJ/mol | TDAs | Wincel, 2004 | gas phase; B |
C4H8N2O4- + 2 = C6H13N3O6-
By formula: C4H8N2O4- + 2C2H5NO2 = C6H13N3O6-
Quantity | Value | Units | Method | Reference | Comment |
---|---|---|---|---|---|
ΔrH° | 63.6 ± 3.3 | kJ/mol | TDAs | Wincel, 2004 | gas phase; B |
Quantity | Value | Units | Method | Reference | Comment |
ΔrG° | 23.8 | kJ/mol | TDAs | Wincel, 2004 | gas phase; B |
C4H9N2O4- + 2 = C6H14N3O6-
By formula: C4H9N2O4- + 2C2H5NO2 = C6H14N3O6-
Quantity | Value | Units | Method | Reference | Comment |
---|---|---|---|---|---|
ΔrH° | 64.4 ± 3.3 | kJ/mol | TDAs | Wincel, 2004 | gas phase; B |
Quantity | Value | Units | Method | Reference | Comment |
ΔrG° | 25.9 | kJ/mol | TDAs | Wincel, 2004 | gas phase; B |
By formula: C2H3NO2- + C2H5NO2 = C4H8N2O4-
Quantity | Value | Units | Method | Reference | Comment |
---|---|---|---|---|---|
ΔrH° | 65.7 ± 3.3 | kJ/mol | TDAs | Wincel, 2004 | gas phase; B |
Quantity | Value | Units | Method | Reference | Comment |
ΔrG° | 35.6 | kJ/mol | TDAs | Wincel, 2004 | gas phase; B |
By formula: C2H4NO2- + C2H5NO2 = C4H9N2O4-
Quantity | Value | Units | Method | Reference | Comment |
---|---|---|---|---|---|
ΔrH° | 67.8 ± 3.3 | kJ/mol | TDAs | Wincel, 2004 | gas phase; B |
Quantity | Value | Units | Method | Reference | Comment |
ΔrG° | 37.7 | kJ/mol | TDAs | Wincel, 2004 | gas phase; B |
By formula: C2H6NO2+ + C2H5NO2 = (C2H6NO2+ • C2H5NO2)
Quantity | Value | Units | Method | Reference | Comment |
---|---|---|---|---|---|
ΔrH° | 130. | kJ/mol | PHPMS | Meot-Ner, Hunter, et al., 1979 | gas phase; M |
Quantity | Value | Units | Method | Reference | Comment |
ΔrS° | 140. | J/mol*K | PHPMS | Meot-Ner, Hunter, et al., 1979 | gas phase; M |

Henry's Law data

Data compiled by: Rolf Sander
Henry's Law constant (water solution)
kH(T) = k°H exp(d(ln(kH))/d(1/T) ((1/T) - 1/(298.15 K)))
k°H = Henry's law constant for solubility in water at 298.15 K (mol/(kg*bar))
d(ln(kH))/d(1/T) = Temperature dependence constant (K)
k°H (mol/(kg*bar)) | d(ln(kH))/d(1/T) (K) | Method | Reference | Comment |
---|---|---|---|---|
21. | X | N/A | Value given here as quoted by missing citation. | |
140. | M | N/A | Value at T = 303. K. | |
21. | V | N/A |

Gas phase ion energetics data

Data evaluated as indicated in comments:
HL - Edward P. Hunter and Sharon G. Lias
L - Sharon G. Lias
Data compiled as indicated in comments:
B - John E. Bartmess
LLK - Sharon G. Lias, Rhoda D. Levin, and Sherif A. Kafafi
RDSH - Henry M. Rosenstock, Keith Draxl, Bruce W. Steiner, and John T. Herron
Quantity | Value | Units | Method | Reference | Comment |
---|---|---|---|---|---|
IE (evaluated) | 10.9 ± 0.05 | eV | N/A | N/A | L |
Quantity | Value | Units | Method | Reference | Comment |
Proton affinity (review) | 765.7 | kJ/mol | N/A | Hunter and Lias, 1998 | HL |
Quantity | Value | Units | Method | Reference | Comment |
Gas basicity | 733.2 | kJ/mol | N/A | Hunter and Lias, 1998 | HL |
Ionization energy determinations
IE (eV) | Method | Reference | Comment |
---|---|---|---|
10.92 ± 0.01 | PE | Dewar, Shanshal, et al., 1969 | RDSH |
10.88 ± 0.05 | PI | Watanabe, Nakayama, et al., 1962 | RDSH |
11.02 | PE | Kimura, Katsumata, et al., 1981 | Vertical value; LLK |
Appearance energy determinations
Ion | AE (eV) | Other Products | Method | Reference | Comment |
---|---|---|---|---|---|
C2H5+ | 11.0 | NO2 | EI | Tsuda and Hamill, 1966 | RDSH |
C2H5O+ | 10.62 ± 0.07 | NO | EI | Solka and Russell, 1974 | LLK |
De-protonation reactions
C2H4NO2- + =
By formula: C2H4NO2- + H+ = C2H5NO2
Quantity | Value | Units | Method | Reference | Comment |
---|---|---|---|---|---|
ΔrH° | 1489. ± 9.2 | kJ/mol | G+TS | Bartmess, Scott, et al., 1979 | gas phase; value altered from reference due to change in acidity scale; B |
ΔrH° | 1496. ± 12. | kJ/mol | G+TS | Cumming and Kebarle, 1978 | gas phase; B |
Quantity | Value | Units | Method | Reference | Comment |
ΔrG° | 1462. ± 8.4 | kJ/mol | IMRE | Bartmess, Scott, et al., 1979 | gas phase; value altered from reference due to change in acidity scale; B |
ΔrG° | 1469. ± 8.4 | kJ/mol | IMRE | Cumming and Kebarle, 1978 | gas phase; B |

Ion clustering data

Data compiled as indicated in comments:
B - John E. Bartmess
M - Michael M. Meot-Ner (Mautner) and Sharon G. Lias
Clustering reactions
By formula: C2H3NO2- + C2H5NO2 = C4H8N2O4-
Quantity | Value | Units | Method | Reference | Comment |
---|---|---|---|---|---|
ΔrH° | 65.7 ± 3.3 | kJ/mol | TDAs | Wincel, 2004 | gas phase; B |
Quantity | Value | Units | Method | Reference | Comment |
ΔrG° | 35.6 | kJ/mol | TDAs | Wincel, 2004 | gas phase; B |
By formula: C2H4NO2- + C2H5NO2 = C4H9N2O4-
Quantity | Value | Units | Method | Reference | Comment |
---|---|---|---|---|---|
ΔrH° | 67.8 ± 3.3 | kJ/mol | TDAs | Wincel, 2004 | gas phase; B |
Quantity | Value | Units | Method | Reference | Comment |
ΔrG° | 37.7 | kJ/mol | TDAs | Wincel, 2004 | gas phase; B |
C2H5N2O4- + 2 = C4H10N3O6-
By formula: C2H5N2O4- + 2C2H5NO2 = C4H10N3O6-
Quantity | Value | Units | Method | Reference | Comment |
---|---|---|---|---|---|
ΔrH° | 62.3 ± 2.1 | kJ/mol | TDAs | Wincel, 2004 | gas phase; B |
Quantity | Value | Units | Method | Reference | Comment |
ΔrG° | 28.5 | kJ/mol | TDAs | Wincel, 2004 | gas phase; B |
By formula: C2H6NO2+ + C2H5NO2 = (C2H6NO2+ • C2H5NO2)
Quantity | Value | Units | Method | Reference | Comment |
---|---|---|---|---|---|
ΔrH° | 130. | kJ/mol | PHPMS | Meot-Ner, Hunter, et al., 1979 | gas phase; M |
Quantity | Value | Units | Method | Reference | Comment |
ΔrS° | 140. | J/mol*K | PHPMS | Meot-Ner, Hunter, et al., 1979 | gas phase; M |
C4H8N2O4- + 2 = C6H13N3O6-
By formula: C4H8N2O4- + 2C2H5NO2 = C6H13N3O6-
Quantity | Value | Units | Method | Reference | Comment |
---|---|---|---|---|---|
ΔrH° | 63.6 ± 3.3 | kJ/mol | TDAs | Wincel, 2004 | gas phase; B |
Quantity | Value | Units | Method | Reference | Comment |
ΔrG° | 23.8 | kJ/mol | TDAs | Wincel, 2004 | gas phase; B |
C4H9N2O4- + 2 = C6H14N3O6-
By formula: C4H9N2O4- + 2C2H5NO2 = C6H14N3O6-
Quantity | Value | Units | Method | Reference | Comment |
---|---|---|---|---|---|
ΔrH° | 64.4 ± 3.3 | kJ/mol | TDAs | Wincel, 2004 | gas phase; B |
Quantity | Value | Units | Method | Reference | Comment |
ΔrG° | 25.9 | kJ/mol | TDAs | Wincel, 2004 | gas phase; B |
C4H10N2O6- + 2 = C6H15N3O8-
By formula: C4H10N2O6- + 2C2H5NO2 = C6H15N3O8-
Quantity | Value | Units | Method | Reference | Comment |
---|---|---|---|---|---|
ΔrH° | 53.1 ± 2.1 | kJ/mol | TDAs | Wincel, 2004 | gas phase; B |
Quantity | Value | Units | Method | Reference | Comment |
ΔrG° | 18.4 | kJ/mol | TDAs | Wincel, 2004 | gas phase; B |
C4H10N3O6- + 3 = C6H15N4O8-
By formula: C4H10N3O6- + 3C2H5NO2 = C6H15N4O8-
Quantity | Value | Units | Method | Reference | Comment |
---|---|---|---|---|---|
ΔrH° | 49.4 ± 2.1 | kJ/mol | TDAs | Wincel, 2004 | gas phase; B |
Quantity | Value | Units | Method | Reference | Comment |
ΔrG° | 16.7 | kJ/mol | TDAs | Wincel, 2004 | gas phase; B |
C6H15N3O6- + 3 = C8H20N4O8-
By formula: C6H15N3O6- + 3C2H5NO2 = C8H20N4O8-
Quantity | Value | Units | Method | Reference | Comment |
---|---|---|---|---|---|
ΔrH° | 56.9 ± 1.3 | kJ/mol | TDAs | Wincel, 2004 | gas phase; B |
Quantity | Value | Units | Method | Reference | Comment |
ΔrG° | 19.7 | kJ/mol | TDAs | Wincel, 2004 | gas phase; B |
C6H15N3O8- + 3 = C8H20N4O10-
By formula: C6H15N3O8- + 3C2H5NO2 = C8H20N4O10-
Quantity | Value | Units | Method | Reference | Comment |
---|---|---|---|---|---|
ΔrH° | 47.3 ± 2.1 | kJ/mol | TDAs | Wincel, 2004 | gas phase; B |
Quantity | Value | Units | Method | Reference | Comment |
ΔrG° | 10.0 | kJ/mol | TDAs | Wincel, 2004 | gas phase; B |
C6H15N4O8- + 4 = C8H20N5O10-
By formula: C6H15N4O8- + 4C2H5NO2 = C8H20N5O10-
Quantity | Value | Units | Method | Reference | Comment |
---|---|---|---|---|---|
ΔrH° | 46.0 ± 2.1 | kJ/mol | TDAs | Wincel, 2004 | gas phase; B |
Quantity | Value | Units | Method | Reference | Comment |
ΔrG° | 11.3 | kJ/mol | TDAs | Wincel, 2004 | gas phase; B |
C8H20N4O8- + 4 = C10H25N5O10-
By formula: C8H20N4O8- + 4C2H5NO2 = C10H25N5O10-
Quantity | Value | Units | Method | Reference | Comment |
---|---|---|---|---|---|
ΔrH° | 49.8 ± 2.1 | kJ/mol | TDAs | Wincel, 2004 | gas phase; B |
Quantity | Value | Units | Method | Reference | Comment |
ΔrG° | 8.79 | kJ/mol | TDAs | Wincel, 2004 | gas phase; B |
C8H20N4O10- + 4 = C10H25N5O12-
By formula: C8H20N4O10- + 4C2H5NO2 = C10H25N5O12-
Quantity | Value | Units | Method | Reference | Comment |
---|---|---|---|---|---|
ΔrH° | 43.9 ± 2.1 | kJ/mol | TDAs | Wincel, 2004 | gas phase; B |
Quantity | Value | Units | Method | Reference | Comment |
ΔrG° | 2.9 | kJ/mol | TDAs | Wincel, 2004 | gas phase; B |
+
= C2H5N2O4-
By formula: NO2- + C2H5NO2 = C2H5N2O4-
Quantity | Value | Units | Method | Reference | Comment |
---|---|---|---|---|---|
ΔrH° | 66.1 ± 2.1 | kJ/mol | TDAs | Wincel, 2004 | gas phase; B |
Quantity | Value | Units | Method | Reference | Comment |
ΔrG° | 37.2 | kJ/mol | TDAs | Wincel, 2004 | gas phase; B |

Kovats' RI, non-polar column, isothermal

Column type | Active phase | Temperature (C) | I | Reference | Comment |
---|---|---|---|---|---|
Capillary | HP-1 | 100. | 618.58 | Görgényi and Héberger, 2003 | N2; Column length: 30. m; Phase thickness: 3. μm |
Capillary | HP-1 | 110. | 619.51 | Görgényi and Héberger, 2003 | N2; Column length: 30. m; Phase thickness: 3. μm |
Capillary | HP-1 | 120. | 620.51 | Görgényi and Héberger, 2003 | N2; Column length: 30. m; Phase thickness: 3. μm |
Capillary | HP-1 | 20. | 616.27 | Görgényi and Héberger, 2003 | N2; Column length: 30. m; Phase thickness: 3. μm |
Capillary | HP-1 | 30. | 615.97 | Görgényi and Héberger, 2003 | N2; Column length: 30. m; Phase thickness: 3. μm |
Capillary | HP-1 | 40. | 615.90 | Görgényi and Héberger, 2003 | N2; Column length: 30. m; Phase thickness: 3. μm |
Capillary | HP-1 | 50. | 616.07 | Görgényi and Héberger, 2003 | N2; Column length: 30. m; Phase thickness: 3. μm |
Capillary | HP-1 | 60. | 616.25 | Görgényi and Héberger, 2003 | N2; Column length: 30. m; Phase thickness: 3. μm |
Capillary | HP-1 | 70. | 616.67 | Görgényi and Héberger, 2003 | N2; Column length: 30. m; Phase thickness: 3. μm |
Capillary | HP-1 | 80. | 617.22 | Görgényi and Héberger, 2003 | N2; Column length: 30. m; Phase thickness: 3. μm |
Capillary | HP-1 | 90. | 617.81 | Görgényi and Héberger, 2003 | N2; Column length: 30. m; Phase thickness: 3. μm |
Packed | C78, Branched paraffin | 130. | 567.8 | Reddy, Dutoit, et al., 1992 | Chromosorb G HP; Column length: 3.3 m |
Packed | Apolane | 130. | 572. | Dutoit, 1991 | Column length: 3.7 m |
Packed | SF-96 | 100. | 638. | Boneva and Dimov, 1979 | N2; Column length: 2. m |
Packed | SF-96 | 110. | 638. | Boneva and Dimov, 1979 | N2; Column length: 2. m |
Packed | SF-96 | 90. | 634. | Boneva and Dimov, 1979 | N2; Column length: 2. m |
Packed | Apiezon L | 100. | 592. | Brown, Chapman, et al., 1968 | N2, DCMS-treated Chromosorb W; Column length: 2.3 m |
Packed | Apiezon L | 150. | 609. | Brown, Chapman, et al., 1968 | N2, DCMS-treated Chromosorb W; Column length: 2.3 m |
Packed | DC-200 | 100. | 623. | Rohrschneider, 1966 | Column length: 4. m |
Packed | Apiezon L | 100. | 598. | Rohrschneider, 1966 | Column length: 5. m |
Packed | Apiezon L | 130. | 590. | Wehrli and Kováts, 1959 | Celite; Column length: 2.25 m |
Packed | Apiezon L | 70. | 583. | Wehrli and Kováts, 1959 | Celite; Column length: 2.25 m |

Kovats' RI, polar column, isothermal

Column type | Active phase | Temperature (C) | I | Reference | Comment |
---|---|---|---|---|---|
Capillary | HP-Innowax | 100. | 1194.2 | Görgényi and Héberger, 2003 | Column length: 30. m; Phase thickness: 0.5 μm |
Capillary | HP-Innowax | 110. | 1196.2 | Görgényi and Héberger, 2003 | Column length: 30. m; Phase thickness: 0.5 μm |
Capillary | HP-Innowax | 120. | 1199.2 | Görgényi and Héberger, 2003 | Column length: 30. m; Phase thickness: 0.5 μm |
Capillary | HP-Innowax | 50. | 1179.4 | Görgényi and Héberger, 2003 | Column length: 30. m; Phase thickness: 0.5 μm |
Capillary | HP-Innowax | 60. | 1181.3 | Görgényi and Héberger, 2003 | Column length: 30. m; Phase thickness: 0.5 μm |
Capillary | HP-Innowax | 70. | 1183.9 | Görgényi and Héberger, 2003 | Column length: 30. m; Phase thickness: 0.5 μm |
Capillary | HP-Innowax | 80. | 1187.3 | Görgényi and Héberger, 2003 | Column length: 30. m; Phase thickness: 0.5 μm |
Capillary | HP-Innowax | 90. | 1190.2 | Görgényi and Héberger, 2003 | Column length: 30. m; Phase thickness: 0.5 μm |
Packed | Carbowax 20M | 100. | 1168. | Rohrschneider, 1966 | Column length: 2. m |

Van Den Dool and Kratz RI, non-polar column, temperature ramp

Column type | Active phase | I | Reference | Comment |
---|---|---|---|---|
Capillary | DB-5 | 636.89 | Hobbs and Conde, 1992 | 30. m/0.25 mm/0.25 μm, 5. K/min; Tstart: 40. C; Tend: 300. C |

Normal alkane RI, non-polar column, custom temperature program

Column type | Active phase | I | Reference | Comment |
---|---|---|---|---|
Capillary | Methyl Silicone | 590. | N/A | Program: not specified |
Capillary | SPB-1 | 618. | Flanagan, Streete, et al., 1997 | 60. m/0.53 mm/5. μm, He; Program: 40C(6min) => 5C/min => 80C => 10C/min => 200C |
Capillary | Polydimethyl siloxanes | 623. | Zenkevich and Chupalov, 1996 | Program: not specified |
Capillary | SPB-1 | 618. | Strete, Ruprah, et al., 1992 | 60. m/0.53 mm/5.0 μm, Helium; Program: 40 0C (6 min) 5 0C/min -> 80 0C 10 0C/min -> 200 0C |
Capillary | SPB-1 | 655. | Strete, Ruprah, et al., 1992 | 60. m/0.53 mm/5.0 μm, Helium; Program: not specified |

Normal alkane RI, polar column, custom temperature program

Column type | Active phase | I | Reference | Comment |
---|---|---|---|---|
Capillary | Carbowax 20M | 1161. | Ramsey and Flanagan, 1982 | Program: not specified |

References

Lebedeva and Ryadenko, 1973
Lebedeva, N.D.; Ryadenko, V.L.R.,
Enthalpies of formation of nitroalkanes,
Russ. J. Phys. Chem. (Engl. Transl.), 1973, 47, 1382. [all data]
Cass, Fletcher, et al., 1958
Cass, R.C.; Fletcher, S.E.; Mortimer, C.T.; Quincey, P.G.; Springall, H.D.,
Heats of combustion and molecular structure. Part IV. Aliphatic nitroalkanes and nitric esters,
J. Chem. Soc., 1958, 958-962. [all data]
Cox and Pilcher, 1970
Cox, J.D.; Pilcher, G.,
Thermochemistry of Organic and Organometallic Compounds, Academic Press, New York, 1970, 1-636. [all data]
Holcomb and Dorsey, 1949
Holcomb, D.E.; Dorsey, C.L., Jr.,
Thermodynamic properties of nitroparaffins,
Ind. Eng. Chem., 1949, 41, 2788-2792. [all data]
Liu and Ziegler, 1966
Liu, K.F.; Ziegler, W.T.,
Heat capacity from 80° to 300°K., melting point and heat of fusion of nitroethane,
J. Chem. Eng. Data, 1966, 11, 187-189. [all data]
Toops, 1956
Toops, E.E.,
Physical Properties of High Purity Nitroparaffins,
J. Phys. Chem., 1956, 60, 304-6. [all data]
Stephenson and Malanowski, 1987
Stephenson, Richard M.; Malanowski, Stanislaw,
Handbook of the Thermodynamics of Organic Compounds, 1987, https://doi.org/10.1007/978-94-009-3173-2
. [all data]
Toops, 1956, 2
Toops, Emory E.,
Physical Properties of Eight High-Purity Nitroparaffins,
J. Phys. Chem., 1956, 60, 3, 304-306, https://doi.org/10.1021/j150537a012
. [all data]
Dykyj, 1970
Dykyj, J.,
Petrochemica, 1970, 10, 2, 51. [all data]
Stull, 1947
Stull, Daniel R.,
Vapor Pressure of Pure Substances. Organic and Inorganic Compounds,
Ind. Eng. Chem., 1947, 39, 4, 517-540, https://doi.org/10.1021/ie50448a022
. [all data]
Tolstova, Kogan, et al., 1965
Tolstova, T.S.; Kogan, V.B.; Skorokhodova, V.L.,
Equilibrium Liquid-Steam in Systems Nitrobensol-Nitromethane, Nitrobensol-Nitroethane,
Zh. Prikl. Khim. (Leningrad), 1965, 38, 11, 2617-2618. [all data]
Domalski and Hearing, 1996
Domalski, Eugene S.; Hearing, Elizabeth D.,
Heat Capacities and Entropies of Organic Compounds in the Condensed Phase. Volume III,
J. Phys. Chem. Ref. Data, 1996, 25, 1, 1, https://doi.org/10.1063/1.555985
. [all data]
Bartmess, Scott, et al., 1979
Bartmess, J.E.; Scott, J.A.; McIver, R.T., Jr.,
The gas phase acidity scale from methanol to phenol,
J. Am. Chem. Soc., 1979, 101, 6047. [all data]
Cumming and Kebarle, 1978
Cumming, J.B.; Kebarle, P.,
Summary of gas phase measurements involving acids AH. Entropy changes in proton transfer reactions involving negative ions. Bond dissociation energies D(A-H) and electron affinities EA(A),
Can. J. Chem., 1978, 56, 1. [all data]
Wincel, 2004
Wincel, H.,
Gas-phase clustering reactions of NO2-, C2H3NO2-, C2H4NO2-C2H5NO2- and C2H5NO4- with C2H5NO2,
Int. J. Mass Spectrom., 2004, 232, 2, 185-194, https://doi.org/10.1016/j.ijms.2004.01.003
. [all data]
Meot-Ner, Hunter, et al., 1979
Meot-Ner, (Mautner); Hunter, E.P.; Field, F.H.,
Ion Thermochemistry of Low Volatility Compounds in the Gas Phase. I. Intrinsic Basicities of Alpha - Amino Acids,
J. Am. Chem. Soc., 1979, 101, 3, 686, https://doi.org/10.1021/ja00497a034
. [all data]
Hunter and Lias, 1998
Hunter, E.P.; Lias, S.G.,
Evaluated Gas Phase Basicities and Proton Affinities of Molecules: An Update,
J. Phys. Chem. Ref. Data, 1998, 27, 3, 413-656, https://doi.org/10.1063/1.556018
. [all data]
Dewar, Shanshal, et al., 1969
Dewar, M.J.S.; Shanshal, M.; Worley, S.D.,
Calculated and observed ionization potentials gf nitroalkanes and of nitrous and nitric acids and esters. Extension of the MINDO method to nitrogen-oxygen compounds,
J. Am. Chem. Soc., 1969, 91, 3590. [all data]
Watanabe, Nakayama, et al., 1962
Watanabe, K.; Nakayama, T.; Mottl, J.,
Ionization potentials of some molecules,
J. Quant. Spectry. Radiative Transfer, 1962, 2, 369. [all data]
Kimura, Katsumata, et al., 1981
Kimura, K.; Katsumata, S.; Achiba, Y.; Yamazaki, T.; Iwata, S.,
Ionization energies, Ab initio assignments, and valence electronic structure for 200 molecules
in Handbook of HeI Photoelectron Spectra of Fundamental Organic Compounds, Japan Scientific Soc. Press, Tokyo, 1981. [all data]
Tsuda and Hamill, 1966
Tsuda, S.; Hamill, W.H.,
Ionization efficiency measurements by the retarding potential difference method,
Advan. Mass Spectrom., 1966, 3, 249. [all data]
Solka and Russell, 1974
Solka, B.H.; Russell, M.E.,
Energetics of formation of some structural isomers of gaseous C2H5O+ C2H6N+ ions,
J. Phys. Chem., 1974, 78, 1268. [all data]
Görgényi and Héberger, 2003
Görgényi, M.; Héberger, K.,
Minimum in the temperature dependence of the Kováts retention indices of nitroalkanes and alkanenitriles on an apolar phase,
J. Chromatogr. A, 2003, 985, 1-2, 11-19, https://doi.org/10.1016/S0021-9673(02)01842-3
. [all data]
Reddy, Dutoit, et al., 1992
Reddy, K.S.; Dutoit, J.-Cl.; Kovats, E. sz.,
Pair-wise interactions by gas chromatography. I. Interaction free enthalpies of solutes with non-associated primary alcohol groups,
J. Chromatogr., 1992, 609, 1-2, 229-259, https://doi.org/10.1016/0021-9673(92)80167-S
. [all data]
Dutoit, 1991
Dutoit, J.,
Gas chromatographic retention behaviour of some solutes on structurally similar polar and non-polar stationary phases,
J. Chromatogr., 1991, 555, 1-2, 191-204, https://doi.org/10.1016/S0021-9673(01)87179-X
. [all data]
Boneva and Dimov, 1979
Boneva, S.; Dimov, N.,
Chromatographic retention indices of C1-C4 nitroparaffins,
Zh. Anal. Khim., 1979, 34, 6, 902-905. [all data]
Brown, Chapman, et al., 1968
Brown, I.; Chapman, I.L.; Nicholson, G.J.,
Gas chromatography of polar solutes in electron acceptor stationary phases,
Aust. J. Chem., 1968, 21, 5, 1125-1141, https://doi.org/10.1071/CH9681125
. [all data]
Rohrschneider, 1966
Rohrschneider, L.,
Eine methode zur charakterisierung von gaschromatographischen trennflüssigkeiten,
J. Chromatogr., 1966, 22, 6-22, https://doi.org/10.1016/S0021-9673(01)97064-5
. [all data]
Wehrli and Kováts, 1959
Wehrli, A.; Kováts, E.,
Gas-chromatographische Charakterisierung ogranischer Verbindungen. Teil 3: Berechnung der Retentionsindices aliphatischer, alicyclischer und aromatischer Verbindungen,
Helv. Chim. Acta, 1959, 7, 7, 2709-2736, https://doi.org/10.1002/hlca.19590420745
. [all data]
Hobbs and Conde, 1992
Hobbs, J.R.; Conde, E.P.,
Gas chromatographic retention indices of explosives and nitro-compounds
in Advances in Analysis and Detection of Explosives: Proceedings of the 4th International Symposium on Analysis of Detection of Explosives, September 7-10, 1992, Jerusalem Israel, J. Yinon, ed(s)., Kluwer Academic Publishers, Netherlands, 1992, 153-164. [all data]
Flanagan, Streete, et al., 1997
Flanagan, R.J.; Streete, P.J.; Ramsey, J.D.,
Volatile Substance Abuse, UNODC Technical Series, No 5, United Nations, Office on Drugs and Crime, Vienna International Centre, PO Box 500, A-1400 Vienna, Austria, 1997, 56, retrieved from http://www.odccp.org/pdf/technicalseries1997-01-011.pdf. [all data]
Zenkevich and Chupalov, 1996
Zenkevich, I.G.; Chupalov, A.A.,
New Possibilities of Chromato Mass Pectrometric Identification of Organic Compounds Using Increments of Gas Chromatographic Retention Indices of Molecular Structural Fragments,
Zh. Org. Khim. (Rus.), 1996, 32, 5, 656-666. [all data]
Strete, Ruprah, et al., 1992
Strete, P.J.; Ruprah, M.; Ramsey, J.D.; Flanagan, R.J.,
Detection and identification of volatile substances by headspace capillary gas chromatography to aid the diagnosis of acute poisoning,
Analyst, 1992, 117, 7, 1111-1127, https://doi.org/10.1039/an9921701111
. [all data]
Ramsey and Flanagan, 1982
Ramsey, J.D.; Flanagan, R.J.,
Detection and Identification of Volatile Organic Compounds in Blood by Headspace Gas Chromatography as an Aid to the Diagnosis of Solvent Abuse,
J. Chromatogr., 1982, 240, 2, 423-444, https://doi.org/10.1016/S0021-9673(00)99622-5
. [all data]