Acetamide, N-methyl-
- Formula: C3H7NO
- Molecular weight: 73.0938
- IUPAC Standard InChIKey: OHLUUHNLEMFGTQ-UHFFFAOYSA-N
- CAS Registry Number: 79-16-3
- Chemical structure:
View 3d structure (requires JavaScript / HTML 5) - Other names: Methylacetamide; Monomethylacetamide; N-Methylacetamide; CH3CONHCH3; Acetylmethylamine; N-Acetyl-N-methylamine; X 44

Gas phase thermochemistry data

Data compiled by: Hussein Y. Afeefy, Joel F. Liebman, and Stephen E. Stein
Quantity | Value | Units | Method | Reference | Comment |
---|---|---|---|---|---|
ΔfH°gas | -248.0 ± 5.5 | kJ/mol | Ccb | Roux, Jimenez, et al., 1996 |

Reaction thermochemistry data

Data compiled as indicated in comments:
B - John E. Bartmess
M - Michael M. Meot-Ner (Mautner) and Sharon G. Lias
RCD - Robert C. Dunbar
Individual Reactions
By formula: C2H3O2- + C3H7NO = (C2H3O2- • C3H7NO)
Bond type: Hydrogen bonds of deprotonated acids to amides
Quantity | Value | Units | Method | Reference | Comment |
---|---|---|---|---|---|
ΔrH° | 106. ± 4.2 | kJ/mol | TDAs | Meot-ner, 1988 | gas phase; B,M |
Quantity | Value | Units | Method | Reference | Comment |
ΔrS° | 115. | J/mol*K | PHPMS | Meot-Ner (Mautner), 1988 | gas phase; M |
Quantity | Value | Units | Method | Reference | Comment |
ΔrG° | 72.0 ± 4.2 | kJ/mol | TDAs | Meot-ner, 1988 | gas phase; B |
By formula: C4H4N- + C3H7NO = (C4H4N- • C3H7NO)
Quantity | Value | Units | Method | Reference | Comment |
---|---|---|---|---|---|
ΔrH° | 110. | kJ/mol | PHPMS | Meot-Ner (Mautner), 1988 | gas phase; M |
Quantity | Value | Units | Method | Reference | Comment |
ΔrS° | 130. | J/mol*K | PHPMS | Meot-Ner (Mautner), 1988 | gas phase; M |
Free energy of reaction
ΔrG° (kJ/mol) | T (K) | Method | Reference | Comment |
---|---|---|---|---|
49.8 | 497. | PHPMS | Meot-Ner (Mautner), 1988 | gas phase; M |
By formula: C3H6NO- + C3H7NO = (C3H6NO- • C3H7NO)
Quantity | Value | Units | Method | Reference | Comment |
---|---|---|---|---|---|
ΔrH° | 110. | kJ/mol | PHPMS | Meot-Ner (Mautner), 1988 | gas phase; M |
Quantity | Value | Units | Method | Reference | Comment |
ΔrS° | 130. | J/mol*K | PHPMS | Meot-Ner (Mautner), 1988 | gas phase; M |
Free energy of reaction
ΔrG° (kJ/mol) | T (K) | Method | Reference | Comment |
---|---|---|---|---|
52.3 | 497. | PHPMS | Meot-Ner (Mautner), 1988 | gas phase; M |
By formula: (C2H3O2- • C3H7NO) + C3H7NO = (C2H3O2- • 2C3H7NO)
Bond type: Hydrogen bonds of deprotonated acids to amides
Quantity | Value | Units | Method | Reference | Comment |
---|---|---|---|---|---|
ΔrH° | 73.6 | kJ/mol | PHPMS | Meot-Ner (Mautner), 1988 | gas phase; M |
Quantity | Value | Units | Method | Reference | Comment |
ΔrS° | 91.2 | J/mol*K | PHPMS | Meot-Ner (Mautner), 1988 | gas phase; M |
By formula: C3H8NO+ + C3H7NO = (C3H8NO+ • C3H7NO)
Bond type: Hydrogen bonds of the type OH-O between organics
Quantity | Value | Units | Method | Reference | Comment |
---|---|---|---|---|---|
ΔrH° | 125. | kJ/mol | PHPMS | Meot-Ner, 1984 | gas phase; M |
Quantity | Value | Units | Method | Reference | Comment |
ΔrS° | 98.7 | J/mol*K | PHPMS | Meot-Ner, 1984 | gas phase; M |
C3H6NO- + =
By formula: C3H6NO- + H+ = C3H7NO
Quantity | Value | Units | Method | Reference | Comment |
---|---|---|---|---|---|
ΔrH° | 1514. ± 9.2 | kJ/mol | G+TS | Decouzon, Exner, et al., 1990 | gas phase; B |
Quantity | Value | Units | Method | Reference | Comment |
ΔrG° | 1483. ± 8.4 | kJ/mol | IMRE | Decouzon, Exner, et al., 1990 | gas phase; B |
By formula: Li+ + C3H7NO = (Li+ • C3H7NO)
Free energy of reaction
ΔrG° (kJ/mol) | T (K) | Method | Reference | Comment |
---|---|---|---|---|
173. | 373. | CIDT,ICR | Herreros, Gal, et al., 1999 | RCD |
By formula: Na+ + C3H7NO = (Na+ • C3H7NO)
Quantity | Value | Units | Method | Reference | Comment |
---|---|---|---|---|---|
ΔrH° | 149. | kJ/mol | CIDT | Klassen, Anderson, et al., 1996 | RCD |
By formula: K+ + C3H7NO = (K+ • C3H7NO)
Quantity | Value | Units | Method | Reference | Comment |
---|---|---|---|---|---|
ΔrH° | 127. | kJ/mol | CIDT | Klassen, Anderson, et al., 1996 | RCD |

Gas phase ion energetics data

Data evaluated as indicated in comments:
HL - Edward P. Hunter and Sharon G. Lias
Data compiled as indicated in comments:
B - John E. Bartmess
LLK - Sharon G. Lias, Rhoda D. Levin, and Sherif A. Kafafi
RDSH - Henry M. Rosenstock, Keith Draxl, Bruce W. Steiner, and John T. Herron
Quantity | Value | Units | Method | Reference | Comment |
---|---|---|---|---|---|
Proton affinity (review) | 888.5 | kJ/mol | N/A | Hunter and Lias, 1998 | HL |
Quantity | Value | Units | Method | Reference | Comment |
Gas basicity | 857.6 | kJ/mol | N/A | Hunter and Lias, 1998 | HL |
Ionization energy determinations
IE (eV) | Method | Reference | Comment |
---|---|---|---|
9.70 ± 0.05 | EI | Baldwin, Loudon, et al., 1977 | LLK |
8.90 ± 0.02 | PI | Watanabe, Nakayama, et al., 1962 | RDSH |
~9.85 | PE | Sweigart and Turner, 1972 | Vertical value; LLK |
Appearance energy determinations
Ion | AE (eV) | Other Products | Method | Reference | Comment |
---|---|---|---|---|---|
CH4N+ | 11.50 | ? | EI | Loudon and Webb, 1977 | LLK |
C2H3O+ | 12.40 | ? | EI | Loudon and Webb, 1977 | LLK |
C2H4NO+ | 11.80 | ? | EI | Loudon and Webb, 1977 | LLK |
De-protonation reactions
C3H6NO- + =
By formula: C3H6NO- + H+ = C3H7NO
Quantity | Value | Units | Method | Reference | Comment |
---|---|---|---|---|---|
ΔrH° | 1514. ± 9.2 | kJ/mol | G+TS | Decouzon, Exner, et al., 1990 | gas phase; B |
Quantity | Value | Units | Method | Reference | Comment |
ΔrG° | 1483. ± 8.4 | kJ/mol | IMRE | Decouzon, Exner, et al., 1990 | gas phase; B |

Ion clustering data

Data compiled as indicated in comments:
B - John E. Bartmess
M - Michael M. Meot-Ner (Mautner) and Sharon G. Lias
RCD - Robert C. Dunbar
Clustering reactions
By formula: C2H3O2- + C3H7NO = (C2H3O2- • C3H7NO)
Bond type: Hydrogen bonds of deprotonated acids to amides
Quantity | Value | Units | Method | Reference | Comment |
---|---|---|---|---|---|
ΔrH° | 106. ± 4.2 | kJ/mol | TDAs | Meot-ner, 1988 | gas phase; B,M |
Quantity | Value | Units | Method | Reference | Comment |
ΔrS° | 115. | J/mol*K | PHPMS | Meot-Ner (Mautner), 1988 | gas phase; M |
Quantity | Value | Units | Method | Reference | Comment |
ΔrG° | 72.0 ± 4.2 | kJ/mol | TDAs | Meot-ner, 1988 | gas phase; B |
By formula: (C2H3O2- • C3H7NO) + C3H7NO = (C2H3O2- • 2C3H7NO)
Bond type: Hydrogen bonds of deprotonated acids to amides
Quantity | Value | Units | Method | Reference | Comment |
---|---|---|---|---|---|
ΔrH° | 73.6 | kJ/mol | PHPMS | Meot-Ner (Mautner), 1988 | gas phase; M |
Quantity | Value | Units | Method | Reference | Comment |
ΔrS° | 91.2 | J/mol*K | PHPMS | Meot-Ner (Mautner), 1988 | gas phase; M |
By formula: C3H6NO- + C3H7NO = (C3H6NO- • C3H7NO)
Quantity | Value | Units | Method | Reference | Comment |
---|---|---|---|---|---|
ΔrH° | 110. | kJ/mol | PHPMS | Meot-Ner (Mautner), 1988 | gas phase; M |
Quantity | Value | Units | Method | Reference | Comment |
ΔrS° | 130. | J/mol*K | PHPMS | Meot-Ner (Mautner), 1988 | gas phase; M |
Free energy of reaction
ΔrG° (kJ/mol) | T (K) | Method | Reference | Comment |
---|---|---|---|---|
52.3 | 497. | PHPMS | Meot-Ner (Mautner), 1988 | gas phase; M |
By formula: C3H8NO+ + C3H7NO = (C3H8NO+ • C3H7NO)
Bond type: Hydrogen bonds of the type OH-O between organics
Quantity | Value | Units | Method | Reference | Comment |
---|---|---|---|---|---|
ΔrH° | 125. | kJ/mol | PHPMS | Meot-Ner, 1984 | gas phase; M |
Quantity | Value | Units | Method | Reference | Comment |
ΔrS° | 98.7 | J/mol*K | PHPMS | Meot-Ner, 1984 | gas phase; M |
By formula: C4H4N- + C3H7NO = (C4H4N- • C3H7NO)
Quantity | Value | Units | Method | Reference | Comment |
---|---|---|---|---|---|
ΔrH° | 110. | kJ/mol | PHPMS | Meot-Ner (Mautner), 1988 | gas phase; M |
Quantity | Value | Units | Method | Reference | Comment |
ΔrS° | 130. | J/mol*K | PHPMS | Meot-Ner (Mautner), 1988 | gas phase; M |
Free energy of reaction
ΔrG° (kJ/mol) | T (K) | Method | Reference | Comment |
---|---|---|---|---|
49.8 | 497. | PHPMS | Meot-Ner (Mautner), 1988 | gas phase; M |
By formula: K+ + C3H7NO = (K+ • C3H7NO)
Quantity | Value | Units | Method | Reference | Comment |
---|---|---|---|---|---|
ΔrH° | 127. | kJ/mol | CIDT | Klassen, Anderson, et al., 1996 | RCD |
By formula: Li+ + C3H7NO = (Li+ • C3H7NO)
Free energy of reaction
ΔrG° (kJ/mol) | T (K) | Method | Reference | Comment |
---|---|---|---|---|
173. | 373. | CIDT,ICR | Herreros, Gal, et al., 1999 | RCD |
By formula: Na+ + C3H7NO = (Na+ • C3H7NO)
Quantity | Value | Units | Method | Reference | Comment |
---|---|---|---|---|---|
ΔrH° | 149. | kJ/mol | CIDT | Klassen, Anderson, et al., 1996 | RCD |

Condensed phase thermochemistry data

Data compiled by: Hussein Y. Afeefy, Joel F. Liebman, and Stephen E. Stein
Quantity | Value | Units | Method | Reference | Comment |
---|---|---|---|---|---|
ΔfH°liquid | -313.2 ± 1.3 | kJ/mol | Ccb | Vasil'eva and Zhil'tsova, 1982 | hf298 calculated possible error by authors |
Quantity | Value | Units | Method | Reference | Comment |
ΔcH°liquid | -1867.7 ± 1.3 | kJ/mol | Ccb | Vasil'eva and Zhil'tsova, 1982 | hf298 calculated possible error by authors |
Quantity | Value | Units | Method | Reference | Comment |
ΔfH°solid | -318.8 ± 5.1 | kJ/mol | Ccb | Roux, Jimenez, et al., 1996 | |
Quantity | Value | Units | Method | Reference | Comment |
ΔcH°solid | -1862.1 ± 5.1 | kJ/mol | Ccb | Roux, Jimenez, et al., 1996 |

Phase change data

Data compiled as indicated in comments:
BS - Robert L. Brown and Stephen E. Stein
TRC - Thermodynamics Research Center, NIST Boulder Laboratories, Chris Muzny director
AC - William E. Acree, Jr., James S. Chickos
ALS - Hussein Y. Afeefy, Joel F. Liebman, and Stephen E. Stein
Quantity | Value | Units | Method | Reference | Comment |
---|---|---|---|---|---|
Tboil | 478.2 | K | N/A | Weast and Grasselli, 1989 | BS |
Quantity | Value | Units | Method | Reference | Comment |
Tfus | 303.43 | K | N/A | Casteel and Amis, 1974 | Uncertainty assigned by TRC = 0.2 K; TRC |
Tfus | 302.90 | K | N/A | Boje and Hvidt, 1971 | Uncertainty assigned by TRC = 1. K; TRC |
Tfus | 303.67 | K | N/A | Bonner and Kim, 1970 | Uncertainty assigned by TRC = 0.15 K; TRC |
Quantity | Value | Units | Method | Reference | Comment |
ΔsubH° | 70.8 ± 2.0 | kJ/mol | V | Roux, Jimenez, et al., 1996 | ALS |
ΔsubH° | 70.8 ± 2.0 | kJ/mol | N/A | Roux, Jimenez, et al., 1996 | AC |
ΔsubH° | 69.87 ± 0.31 | kJ/mol | N/A | Starzewski, Wadso, et al., 1984 | AC |
Enthalpy of vaporization
ΔvapH (kJ/mol) | Temperature (K) | Method | Reference | Comment |
---|---|---|---|---|
55.5 | 378. | N/A | Schmelzer and Pusch, 1995 | Based on data from 363. to 414. K.; AC |
62. | 368. | N/A | Aucejo, Monton, et al., 1993 | Based on data from 353. to 428. K.; AC |
59.6 | 348. | A | Stephenson and Malanowski, 1987 | Based on data from 333. to 443. K.; AC |
53.5 | 368. | A | Stephenson and Malanowski, 1987 | Based on data from 353. to 479. K.; AC |
Antoine Equation Parameters
log10(P) = A − (B / (T + C))
P = vapor pressure (bar)
T = temperature (K)
View plot Requires a JavaScript / HTML 5 canvas capable browser.
Temperature (K) | A | B | C | Reference | Comment |
---|---|---|---|---|---|
313. to 363. | -0.06922 | 144.114 | -277.873 | Gopal and Rizvi, 1968 | Coefficents calculated by NIST from author's data. |
Enthalpy of sublimation
ΔsubH (kJ/mol) | Temperature (K) | Reference | Comment |
---|---|---|---|
54.0 | 288. to 303. | Aihara, 1952 | See also Jones, 1960.; AC |
Enthalpy of fusion
ΔfusH (kJ/mol) | Temperature (K) | Reference | Comment |
---|---|---|---|
10.11 | 303.7 | Ahlers, Lohmann, et al., 1999 | AC |
9.73 | 303.8 | Kreis and Wood, 1969 | AC |

Kovats' RI, non-polar column, isothermal

View large format table.

Column type Active phase Temperature (C) I Reference Comment
PackedSE-30180.857.Krawczyk and Piotrowski, 1989N2, Chromosorb W AW; Column length: 1. m

Van Den Dool and Kratz RI, polar column, temperature ramp

View large format table.

Column type Active phase I Reference Comment
CapillaryDB-Wax1623.Shiratsuchi, Shimoda, et al., 199460. m/0.25 mm/0.25 μm, 2. K/min, 230. C @ 60. min; Tstart: 50. C
CapillaryDB-Wax1623.Shiratsuchi, Shimoda, et al., 1994, 260. m/0.25 mm/0.25 μm, He, 2. K/min, 230. C @ 60. min; Tstart: 50. C

Normal alkane RI, non-polar column, custom temperature program

View large format table.

Column type Active phase I Reference Comment
CapillaryPolydimethyl siloxanes825.Zenkevich and Chupalov, 1996Program: not specified

Normal alkane RI, polar column, custom temperature program

View large format table.

Column type Active phase I Reference Comment
CapillaryDB-Wax1609.Peng, Yang, et al., 1991Program: not specified
CapillaryDB-Wax1648.Peng, Yang, et al., 1991Program: not specified

References

Roux, Jimenez, et al., 1996
Roux, M.V.; Jimenez, P.; Davalos, J.Z.; Castano, O.; Molina, M.T.; Notario, R.; Herreros, M.; Abboud, J.-L.M.,
The first direct experimental determination of strain in neutral and protonated 2-azetidinone,
J. Am. Chem. Soc., 1996, 118, 12735-12737. [all data]
Meot-ner, 1988
Meot-ner, M.,
Ionic Hydrogen Bond and Ion Solvation. 6. Interaction Energies of the Acetate Ion with Organic Molecules. Comparison of CH3COO- with Cl-, CN-, and SH-,
J. Am. Chem. Soc., 1988, 110, 12, 3854, https://doi.org/10.1021/ja00220a022
. [all data]
Meot-Ner (Mautner), 1988
Meot-Ner (Mautner), M.,
Models for Strong Interactions in Proteins and Enzymes. 2. Interactions of Ions with the Peptide Link and Imidazole,
J. Am. Chem. Soc., 1988, 110, 10, 3075, https://doi.org/10.1021/ja00218a014
. [all data]
Meot-Ner, 1984
Meot-Ner, (Mautner),
The Ionic Hydrogen Bond. 4. Intramolecular and Multiple Bonds. Proton Affinities, Hydration and Complexes of Amides and Amino Acid Derivatives,
J. Am. Chem. Soc., 1984, 106, 2, 278, https://doi.org/10.1021/ja00314a003
. [all data]
Decouzon, Exner, et al., 1990
Decouzon, M.; Exner, O.; Gal, J.-F.; Maria, P.-C.,
The Gas-Phase Acidity and the Acidic Site of Acetohydroxamic Acid: an FT-ICR Study,
J. Org. Chem., 1990, 55, 13, 3980, https://doi.org/10.1021/jo00300a007
. [all data]
Herreros, Gal, et al., 1999
Herreros, M.; Gal, J.-F.; Maria, P.-C.; Decouzon, M.,
Gas-Phase Basicity of Simple Amides Toward Proton and Lithium Cation: An Experimental and Theoretical Study,
Eur. J. Mass Spectrom., 1999, 5, 1, 259, https://doi.org/10.1255/ejms.282
. [all data]
Klassen, Anderson, et al., 1996
Klassen, J.S.; Anderson, S.G.; Blades, A.T.; Kebarle, P.,
Reaction Enthalpies for M+L = M+ + L, Where M+ = Na+ and K+ and L = Acetamide, N-Methylacetamide, N,N-Dimethylacetamide, Glycine, and Glycylglycine, from Determinations of the Collision-Induced Dissociation Thresholds,
J. Phys. Chem., 1996, 100, 33, 14218, https://doi.org/10.1021/jp9608382
. [all data]
Hunter and Lias, 1998
Hunter, E.P.; Lias, S.G.,
Evaluated Gas Phase Basicities and Proton Affinities of Molecules: An Update,
J. Phys. Chem. Ref. Data, 1998, 27, 3, 413-656, https://doi.org/10.1063/1.556018
. [all data]
Baldwin, Loudon, et al., 1977
Baldwin, M.A.; Loudon, A.G.; Webb, K.S.; Cardnell, P.C.,
Charge location and fragmentation under electron impact. V-The ionization potentials of (methylated) phosphoramides, guanidines, formamides, acetamides, ureas and thioureas,
Org. Mass Spectrom., 1977, 12, 279. [all data]
Watanabe, Nakayama, et al., 1962
Watanabe, K.; Nakayama, T.; Mottl, J.,
Ionization potentials of some molecules,
J. Quant. Spectry. Radiative Transfer, 1962, 2, 369. [all data]
Sweigart and Turner, 1972
Sweigart, D.A.; Turner, D.W.,
Lone pair orbitals and their interactions studied by photoelectron spectroscopy. I. Carboxylic acids and their derivatives,
J. Am. Chem. Soc., 1972, 94, 5592. [all data]
Loudon and Webb, 1977
Loudon, A.G.; Webb, K.S.,
The nature of the [C2H6N]+ and [CH4N]+ ions formed by electron impact on methylated formamides, acetamides, ureas, thioureas and hexamethylphosphoramide,
Org. Mass Spectrom., 1977, 12, 283. [all data]