2-Propenoic acid
- Formula: C3H4O2
- Molecular weight: 72.0627
- IUPAC Standard InChIKey: NIXOWILDQLNWCW-UHFFFAOYSA-N
- CAS Registry Number: 79-10-7
- Chemical structure:
View 3d structure (requires JavaScript / HTML 5) - Other names: Acrylic acid; Acroleic acid; Ethylenecarboxylic acid; Propenoic acid; Vinylformic acid; CH2=CHCOOH; Propene acid; Kyselina akrylova; Rcra waste number U008; Glacial acrylic acid; NSC 4765

Gas phase thermochemistry data

Data compiled as indicated in comments:
ALS - Hussein Y. Afeefy, Joel F. Liebman, and Stephen E. Stein
DRB - Donald R. Burgess, Jr.
GT - Glushko Thermocenter, Russian Academy of Sciences, Moscow
Quantity | Value | Units | Method | Reference | Comment |
---|---|---|---|---|---|
ΔfH°gas | -330.7 ± 4.2 | kJ/mol | Ccb | Van-chin-syan, Kochubei, et al., 1996 | ALS |
ΔfH°gas | -324.7 | kJ/mol | N/A | Vilcu and Perisanu, 1980 | Value computed using ΔfHliquid° value of -377.8±9.3 kj/mol from Vilcu and Perisanu, 1980 and ΔvapH° value of 53.1 kj/mol from Van-chin-syan, Kochubei, et al., 1996.; DRB |
ΔfH°gas | -336.9 ± 2.3 | kJ/mol | Eqk | Guthrie, 1978 | ALS |
Constant pressure heat capacity of gas
Cp,gas (J/mol*K) | Temperature (K) | Reference | Comment |
---|---|---|---|
41.03 | 50. | Thermodynamics Research Center, 1997 | p=1 bar.; GT |
45.40 | 100. | ||
52.33 | 150. | ||
61.50 | 200. | ||
76.61 | 273.15 | ||
81.80 | 298.15 | ||
82.18 | 300. | ||
101.24 | 400. | ||
116.65 | 500. | ||
128.73 | 600. | ||
138.32 | 700. | ||
146.12 | 800. | ||
152.60 | 900. | ||
158.08 | 1000. | ||
162.8 | 1100. | ||
166.8 | 1200. | ||
170.2 | 1300. | ||
173.2 | 1400. | ||
175.8 | 1500. |

Condensed phase thermochemistry data

Data compiled as indicated in comments:
ALS - Hussein Y. Afeefy, Joel F. Liebman, and Stephen E. Stein
DH - Eugene S. Domalski and Elizabeth D. Hearing
Quantity | Value | Units | Method | Reference | Comment |
---|---|---|---|---|---|
ΔfH°liquid | -383.8 ± 2.0 | kJ/mol | Ccb | Van-chin-syan, Kochubei, et al., 1996 | ALS |
ΔfH°liquid | -377.8 ± 9.3 | kJ/mol | Ccb | Vilcu and Perisanu, 1980 | ALS |
Quantity | Value | Units | Method | Reference | Comment |
ΔcH°liquid | -1368.8 ± 1.8 | kJ/mol | Ccb | Van-chin-syan, Kochubei, et al., 1996 | Corresponding ΔfHºliquid = -383.4 kJ/mol (simple calculation by NIST; no Washburn corrections); ALS |
ΔcH°liquid | -1374. ± 11. | kJ/mol | Ccb | Vilcu and Perisanu, 1980 | Corresponding ΔfHºliquid = -377.8 kJ/mol (simple calculation by NIST; no Washburn corrections); ALS |
ΔcH°liquid | -1373. ± 5.0 | kJ/mol | Ccb | Moureu and Boutaric, 1920 | Corresponding ΔfHºliquid = -379. kJ/mol (simple calculation by NIST; no Washburn corrections); ALS |
Constant pressure heat capacity of liquid
Cp,liquid (J/mol*K) | Temperature (K) | Reference | Comment |
---|---|---|---|
144.2 | 298.15 | Karabaev, Saidov, et al., 1985 | T = 90 to 350 K. Cp(c) = 313.44 + 3.99T J/kg*K (103 to 252 K); Cp(liq) = 695.42 + 4.38T J/kg*K (285.7 to 350 K). Cp data calculated from equation.; DH |
145.70 | 300. | Karabaev, Abduzhaminov, et al., 1983 | T = 290 to 344 K. Cp given as 2021.8 J/kg*K.; DH |

Phase change data

Data compiled as indicated in comments:
BS - Robert L. Brown and Stephen E. Stein
DH - Eugene S. Domalski and Elizabeth D. Hearing
TRC - Thermodynamics Research Center, NIST Boulder Laboratories, Chris Muzny director
ALS - Hussein Y. Afeefy, Joel F. Liebman, and Stephen E. Stein
DRB - Donald R. Burgess, Jr.
AC - William E. Acree, Jr., James S. Chickos
Quantity | Value | Units | Method | Reference | Comment |
---|---|---|---|---|---|
Tboil | 412.2 | K | N/A | Aldrich Chemical Company Inc., 1990 | BS |
Tboil | 414.8 | K | N/A | Weast and Grasselli, 1989 | BS |
Quantity | Value | Units | Method | Reference | Comment |
Tfus | 285.7 | K | N/A | Karabaev, Saidov, et al., 1985 | DH |
Tfus | 285.7 | K | N/A | Karabaev, Abduzhaminov, et al., 1985 | Uncertainty assigned by TRC = 0.2 K; TRC |
Tfus | 285.3 | K | N/A | Anonymous, 1957 | Uncertainty assigned by TRC = 0.6 K; TRC |
Tfus | 285.45 | K | N/A | Moureu and Boutaric, 1920, 2 | Uncertainty assigned by TRC = 0.5 K; TRC |
Tfus | 290. | K | N/A | Riiber and Schetelig, 1904 | Uncertainty assigned by TRC = 1. K; TRC |
Quantity | Value | Units | Method | Reference | Comment |
Tc | 616.57 | K | N/A | D'Souza and Teja, 1987 | Uncertainty assigned by TRC = 3. K; Ambrose's procedure; TRC |
Quantity | Value | Units | Method | Reference | Comment |
Pc | 52.4273 | bar | N/A | D'Souza and Teja, 1987 | Uncertainty assigned by TRC = 1.00 bar; Ambrose's procedure; TRC |
Quantity | Value | Units | Method | Reference | Comment |
ΔvapH° | 53.1 ± 4.2 | kJ/mol | C | Van-chin-syan, Kochubei, et al., 1996 | ALS |
ΔvapH° | 53.1 | kJ/mol | N/A | Van-chin-syan, Kochubei, et al., 1996 | DRB |
ΔvapH° | 53.1 ± 4.2 | kJ/mol | C | Van-Chin-Syan, Kochubei, et al., 1996 | AC |
ΔvapH° | 57.3 | kJ/mol | N/A | Vilcu and Perisanu, 1980, 2 | AC |
ΔvapH° | 57.3 ± 1.3 | kJ/mol | V | Vilcu and Perisanu, 1980 | ALS |
Enthalpy of vaporization
ΔvapH (kJ/mol) | Temperature (K) | Method | Reference | Comment |
---|---|---|---|---|
45.3 | 356. | A | Stephenson and Malanowski, 1987 | Based on data from 341. to 414. K. See also Linek and Wichterle, 1973.; AC |
32.7 | 308. | N/A | Gubkov, Fermor, et al., 1964 | Based on data from 293. to 343. K.; AC |
Antoine Equation Parameters
log10(P) = A − (B / (T + C))
P = vapor pressure (bar)
T = temperature (K)
View plot Requires a JavaScript / HTML 5 canvas capable browser.
Temperature (K) | A | B | C | Reference | Comment |
---|---|---|---|---|---|
293. to 343. | 2.69607 | 621.275 | -121.929 | Gubkov, Fermor, et al., 1964, 2 | Coefficents calculated by NIST from author's data. |
Enthalpy of fusion
ΔfusH (kJ/mol) | Temperature (K) | Reference | Comment |
---|---|---|---|
9.5097 | 285.7 | Karabaev, Abduzhaminov, et al., 1985, 2 | DH |
11.16 | 285.5 | Acree, 1991 | AC |
Entropy of fusion
ΔfusS (J/mol*K) | Temperature (K) | Reference | Comment |
---|---|---|---|
33.3 | 285.7 | Karabaev, Abduzhaminov, et al., 1985, 2 | DH |

Reaction thermochemistry data

Data compiled as indicated in comments:
B - John E. Bartmess
ALS - Hussein Y. Afeefy, Joel F. Liebman, and Stephen E. Stein
Individual Reactions
C3H3O2- + =
By formula: C3H3O2- + H+ = C3H4O2
Quantity | Value | Units | Method | Reference | Comment |
---|---|---|---|---|---|
ΔrH° | 1440. ± 12. | kJ/mol | G+TS | Graul, Schnute, et al., 1990 | gas phase; B |
Quantity | Value | Units | Method | Reference | Comment |
ΔrG° | 1411. ± 12. | kJ/mol | CIDC | Graul, Schnute, et al., 1990 | gas phase; B |
By formula: C4H10O + C3H4O2 = C7H12O2 + H2O
Quantity | Value | Units | Method | Reference | Comment |
---|---|---|---|---|---|
ΔrH° | 16. | kJ/mol | Eqk | Selyakova, Vytnov, et al., 1976 | liquid phase; Heat of esterification 60-180 C; ALS |
By formula: H2 + C3H4O2 = C3H6O2
Quantity | Value | Units | Method | Reference | Comment |
---|---|---|---|---|---|
ΔrH° | -127.0 ± 0.8 | kJ/mol | Chyd | Skinner and Snelson, 1959 | liquid phase; solvent: Acetic acid; ALS |

Henry's Law data

Data compiled by: Rolf Sander
Henry's Law constant (water solution)
kH(T) = k°H exp(d(ln(kH))/d(1/T) ((1/T) - 1/(298.15 K)))
k°H = Henry's law constant for solubility in water at 298.15 K (mol/(kg*bar))
d(ln(kH))/d(1/T) = Temperature dependence constant (K)
k°H (mol/(kg*bar)) | d(ln(kH))/d(1/T) (K) | Method | Reference | Comment |
---|---|---|---|---|
2400. | Q | N/A | missing citation give several references for the Henry's law constants but don't assign them to specific species. |

Gas phase ion energetics data

Data evaluated as indicated in comments:
L - Sharon G. Lias
Data compiled as indicated in comments:
B - John E. Bartmess
LLK - Sharon G. Lias, Rhoda D. Levin, and Sherif A. Kafafi
Quantity | Value | Units | Method | Reference | Comment |
---|---|---|---|---|---|
IE (evaluated) | 10.60 | eV | N/A | N/A | L |
Ionization energy determinations
IE (eV) | Method | Reference | Comment |
---|---|---|---|
10.6 | PE | Van Dam and Oskam, 1978 | LLK |
10.60 | PE | Katrib and Rabalais, 1973 | LLK |
10.78 | PE | Van Dam and Oskam, 1978 | Vertical value; LLK |
De-protonation reactions
C3H3O2- + =
By formula: C3H3O2- + H+ = C3H4O2
Quantity | Value | Units | Method | Reference | Comment |
---|---|---|---|---|---|
ΔrH° | 1440. ± 12. | kJ/mol | G+TS | Graul, Schnute, et al., 1990 | gas phase; B |
Quantity | Value | Units | Method | Reference | Comment |
ΔrG° | 1411. ± 12. | kJ/mol | CIDC | Graul, Schnute, et al., 1990 | gas phase; B |

References

Van-chin-syan, Kochubei, et al., 1996
Van-chin-syan, Yu.Ya.; Kochubei, V.V.; Sergeev, V.V.; Raevskii, Yu.A.; Gerasimchuk, S.I.; Kotovich, Kh.Z.,
Thermodynamic properties of some acids and aldehydes of the acrylic series,
Sov. J. Chem. Phys. (Engl. Transl.), 1996, 70, 1789-1794, In original 1932. [all data]
Vilcu and Perisanu, 1980
Vilcu, R.; Perisanu, S.,
The ideal gas state enthalpies of formation of some monomers,
Rev. Roum. Chim., 1980, 25, 619-624. [all data]
Guthrie, 1978
Guthrie, J.P.,
Equilibrium constants for a series of simple aldol condensations, and linear free energy relations with other carbonyl addition reactions,
Can. J. Chem., 1978, 56, 962-973. [all data]
Thermodynamics Research Center, 1997
Thermodynamics Research Center,
Selected Values of Properties of Chemical Compounds., Thermodynamics Research Center, Texas A&M University, College Station, Texas, 1997. [all data]
Moureu and Boutaric, 1920
Moureu, C.; Boutaric, A.,
Some physico-chemical constants of acrylic acid,
J. Chim. Phys., 1920, 18, 348-352. [all data]
Karabaev, Saidov, et al., 1985
Karabaev, M.; Saidov, A.A.; Abduzhaminov, T.P.; Kenisarin, M.M.,
Heat capacity and molecular kinetic processes of condensed phase acrylates and methacrylates, Izv. Akad. Nauk UzSSR,
Ser. Fiz.-Math., 1985, (6), 51-54. [all data]
Karabaev, Abduzhaminov, et al., 1983
Karabaev, M.K.; Abduzhaminov, T.P.; Tursunov, Sh.O.; Igamberdyev, Kh.T.,
Temperature dependence of the thermophysical parameters of liquid acrylic acid, Izv. Akad. Nauk Uzb. SSR,
Ser. Fiz.-Mat. Nauk, 1983, (6), 57-58. [all data]
Aldrich Chemical Company Inc., 1990
Aldrich Chemical Company Inc.,
Catalog Handbook of Fine Chemicals, Aldrich Chemical Company, Inc., Milwaukee WI, 1990, 1. [all data]
Weast and Grasselli, 1989
CRC Handbook of Data on Organic Compounds, 2nd Editon, Weast,R.C and Grasselli, J.G., ed(s)., CRC Press, Inc., Boca Raton, FL, 1989, 1. [all data]
Karabaev, Abduzhaminov, et al., 1985
Karabaev, M.K.; Abduzhaminov, T.P.; Kenisarin, M.M.; Saidov, A.A.,
Thermodynamics of the crystal-liquid phase transition in acrylates and methacrylates.,
Izv. Akad. Nauk Uzb. SSR Ser., Fiz-Mat. Nauk, 1985, 1985, No. 5, 74-7. [all data]
Anonymous, 1957
Anonymous, R.,
, Am. Pet. Inst. Res. Proj. 6, Carnegie-Mellon Univ., 1957. [all data]
Moureu and Boutaric, 1920, 2
Moureu, C.; Boutaric, A.,
Some Physico-Chemical Constants of Acrylic Acid,
J. Chim. Phys. Phys.-Chim. Biol., 1920, 18, 348-52. [all data]
Riiber and Schetelig, 1904
Riiber, C.N.; Schetelig,
Z. Phys. Chem., Stoechiom. Verwandtschaftsl., 1904, 48, 345. [all data]
D'Souza and Teja, 1987
D'Souza, R.; Teja, A.S.,
The prediction of the vapor pressures of carboxylic acids,
Chem. Eng. Commun., 1987, 61, 13. [all data]
Van-Chin-Syan, Kochubei, et al., 1996
Van-Chin-Syan, Yu.Ya.; Kochubei, V.V.; Sergeev, V.V.; Raevskii, Yu.A.; Gerasimchuk, S.I.; Kotovich, Kh.Z.,
Thermodynamic properties of some acrylic-series acids and aldehydes,
Zh. Fiz. Khim., 1996, 70, 11, 1932. [all data]
Vilcu and Perisanu, 1980, 2
Vilcu, R.; Perisanu, S.,
Rev. Roum. Chim., 1980, 25, 619. [all data]
Stephenson and Malanowski, 1987
Stephenson, Richard M.; Malanowski, Stanislaw,
Handbook of the Thermodynamics of Organic Compounds, 1987, https://doi.org/10.1007/978-94-009-3173-2
. [all data]
Linek and Wichterle, 1973
Linek, J.; Wichterle, I.,
Liquid-vapour equilibrium. LIX. The systems diisopropyl ether-acrylic acid, isopropyl acetate-acrylic acid, acrylic acid-2-ethylhexanol and methyl isobutyl ketone-acrylic acid,
Collect. Czech. Chem. Commun., 1973, 38, 7, 1846-1852, https://doi.org/10.1135/cccc19731846
. [all data]
Gubkov, Fermor, et al., 1964
Gubkov, A.N.; Fermor, N.A.; Smirnov, N.I.,
Zh. Prikl. Khim. (S.-Peterburg), 1964, 37, 2204. [all data]
Gubkov, Fermor, et al., 1964, 2
Gubkov, A.N.; Fermor, N.A.; Smirnov, N.I.,
Vapor Pressure of Mono-Poly Systems,
Zh. Prikl. Khim. (Leningrad), 1964, 37, 2204-2210. [all data]
Karabaev, Abduzhaminov, et al., 1985, 2
Karabaev, M.K.; Abduzhaminov, T.P.; Kenisarin, M.M.; Saidov, A.A.,
Thermodynamics of the crystal-liquid phase transition in acrylates and methacrylates, Izv. Akad. Nauk Uzb. SSR,
Ser. Fiz.-Mat. Nauk, 1985, (5), 74-77. [all data]
Acree, 1991
Acree, William E.,
Thermodynamic properties of organic compounds: enthalpy of fusion and melting point temperature compilation,
Thermochimica Acta, 1991, 189, 1, 37-56, https://doi.org/10.1016/0040-6031(91)87098-H
. [all data]
Graul, Schnute, et al., 1990
Graul, S.T.; Schnute, M.E.; Squires, R.R.,
Gas-Phase Acidities of Carboxylic Acids and Alcohols from Collision-Induced Dissociation of Dimer Cluster Ions,
Int. J. Mass Spectrom. Ion Proc., 1990, 96, 2, 181, https://doi.org/10.1016/0168-1176(90)87028-F
. [all data]
Selyakova, Vytnov, et al., 1976
Selyakova, V.A.; Vytnov, G.F.; Sineokov, A.P.,
Study of the esterification of acrylic acid by butyl alcohol,
Russ. J. Phys. Chem. (Engl. Transl.), 1976, 50, 1692-1694. [all data]
Skinner and Snelson, 1959
Skinner, H.A.; Snelson, A.,
Heats of hydrogenation Part 3.,
Trans. Faraday Soc., 1959, 55, 405-407. [all data]
Van Dam and Oskam, 1978
Van Dam, H.; Oskam, A.,
He(I) and He(II) photoelectron spectra of some substituted ethylenes,
J. Electron Spectrosc. Relat. Phenom., 1978, 13, 273. [all data]
Katrib and Rabalais, 1973
Katrib, A.; Rabalais, J.W.,
Electronic interaction between the vinyl group and its substituents,
J. Phys. Chem., 1973, 77, 2358. [all data]