Propanoic acid
- Formula: C3H6O2
- Molecular weight: 74.0785
- IUPAC Standard InChIKey: XBDQKXXYIPTUBI-UHFFFAOYSA-N
- CAS Registry Number: 79-09-4
- Chemical structure:
View 3d structure (requires JavaScript / HTML 5) - Other names: Propionic acid; Carboxyethane; Ethanecarboxylic acid; Ethylformic acid; Luprisol; Luprosil; Metacetonic acid; Prozoin; Pseudoacetic acid; C2H5COOH; Methylacetic acid; Acide propionique; Kyselina propionova; Propionic acid grain preserver; Sentry grain preserver; Tenox P grain preservative; UN 1848; MonoProp; Antischim B; Propkorn; Propcorn; n-Propionic acid

Gas phase thermochemistry data

Data compiled by: Donald R. Burgess, Jr.
Quantity | Value | Units | Method | Reference | Comment |
---|---|---|---|---|---|
ΔfH°gas | -108.9 ± 0.48 | kcal/mol | N/A | Lebedeva, 1964 | Value computed using ΔfHliquid° value of -510.8±0.1 kj/mol from Lebedeva, 1964 and ΔvapH° value of 55±2 kj/mol from missing citation. |
ΔfH°gas | -108.9 ± 0.48 | kcal/mol | Ccb | Lebedeva, 1964 | Value computed using ΔfHliquid° from Lebedeva, 1964 and ΔvapH° value of 13. kcal/mol from Konicek and Wadso, 1970. |
ΔfH°gas | -108.7 ± 0.76 | kcal/mol | Ccb | Schjanberg, 1935 | Value computed using ΔfHliquid° from Schjanberg, 1935 and ΔvapH° value of 13. kcal/mol from Konicek and Wadso, 1970. estimated uncertainty |

Condensed phase thermochemistry data

Data compiled as indicated in comments:
ALS - Hussein Y. Afeefy, Joel F. Liebman, and Stephen E. Stein
DRB - Donald R. Burgess, Jr.
DH - Eugene S. Domalski and Elizabeth D. Hearing
Quantity | Value | Units | Method | Reference | Comment |
---|---|---|---|---|---|
ΔfH°liquid | -122.08 ± 0.03 | kcal/mol | Ccb | Lebedeva, 1964 | ALS |
ΔfH°liquid | -121.9 ± 0.60 | kcal/mol | Ccb | Schjanberg, 1935 | estimated uncertainty; DRB |
Quantity | Value | Units | Method | Reference | Comment |
ΔcH°liquid | -365.03 ± 0.03 | kcal/mol | Ccb | Lebedeva, 1964 | Corresponding ΔfHºliquid = -122.07 kcal/mol (simple calculation by NIST; no Washburn corrections); ALS |
ΔcH°liquid | -365.2 | kcal/mol | Ccb | Schjanberg, 1935 | Corresponding ΔfHºliquid = -121.9 kcal/mol (simple calculation by NIST; no Washburn corrections); ALS |
Quantity | Value | Units | Method | Reference | Comment |
S°liquid | 45.65 | cal/mol*K | N/A | Martin and Andon, 1982 | DH |
Constant pressure heat capacity of liquid
Cp,liquid (cal/mol*K) | Temperature (K) | Reference | Comment |
---|---|---|---|
37.91 | 298.15 | Biros, Sikora, et al., 1982 | T = 270 to 370 K. Equation only. Cp = 129.7 - 0.1263 T + 0.0007486 T2 J/mol*K.; DH |
36.52 | 298.15 | Martin and Andon, 1982 | T = 13 to 450 K. Data also given by equation.; DH |
36.95 | 333.15 | Woycicka and Kalinowska, 1978 | DH |
36.1 | 298.15 | Konicek and Wadso, 1971 | DH |
38.10 | 289. | Radulescu and Jula, 1934 | DH |

Phase change data

Data compiled as indicated in comments:
TRC - Thermodynamics Research Center, NIST Boulder Laboratories, Chris Muzny director
BS - Robert L. Brown and Stephen E. Stein
AC - William E. Acree, Jr., James S. Chickos
ALS - Hussein Y. Afeefy, Joel F. Liebman, and Stephen E. Stein
DH - Eugene S. Domalski and Elizabeth D. Hearing
Quantity | Value | Units | Method | Reference | Comment |
---|---|---|---|---|---|
Tboil | 414. ± 1. | K | AVG | N/A | Average of 62 out of 65 values; Individual data points |
Quantity | Value | Units | Method | Reference | Comment |
Tfus | 252. ± 2. | K | AVG | N/A | Average of 8 values; Individual data points |
Quantity | Value | Units | Method | Reference | Comment |
Ttriple | 252.65 | K | N/A | Martin and Andon, 1982, 2 | Uncertainty assigned by TRC = 0.06 K; TRC |
Quantity | Value | Units | Method | Reference | Comment |
Tc | 607. ± 10. | K | AVG | N/A | Average of 8 values; Individual data points |
Quantity | Value | Units | Method | Reference | Comment |
Pc | 46.07 | atm | N/A | Andereya and Chase, 1990 | Uncertainty assigned by TRC = 0.49 atm; TRC |
Pc | 44.71 | atm | N/A | Ambrose and Ghiassee, 1987 | Uncertainty assigned by TRC = 0.49 atm; TRC |
Pc | 47.4724 | atm | N/A | D'Souza and Teja, 1987 | Uncertainty assigned by TRC = 0.89 atm; Ambrose's procedure; TRC |
Pc | 40.07 | atm | N/A | Efremova and Sokolova, 1972 | Uncertainty assigned by TRC = 4.000 atm; TRC |
Pc | 52.90 | atm | N/A | Vespigniani, 1903 | Uncertainty assigned by TRC = 5.0000 atm; TRC |
Quantity | Value | Units | Method | Reference | Comment |
ρc | 4.51 | mol/l | N/A | Efremova and Sokolova, 1972 | Uncertainty assigned by TRC = 0.0450 mol/l; TRC |
ρc | 4.25 | mol/l | N/A | Anonymous, 1928 | Uncertainty assigned by TRC = 0.08 mol/l; TRC |
Quantity | Value | Units | Method | Reference | Comment |
ΔvapH° | 12. ± 4. | kcal/mol | AVG | N/A | Average of 6 values; Individual data points |
Enthalpy of vaporization
ΔvapH (kcal/mol) | Temperature (K) | Method | Reference | Comment |
---|---|---|---|---|
11.2 | 358. | A | Stephenson and Malanowski, 1987 | Based on data from 343. to 419. K.; AC |
14.5 | 429. | A | Stephenson and Malanowski, 1987 | Based on data from 414. to 511. K.; AC |
11.1 | 360. | A | Stephenson and Malanowski, 1987 | Based on data from 345. to 401. K.; AC |
13.4 | 303. | N/A | Tamir, Dragoescu, et al., 1983 | AC |
11.5 | 343. | N/A | Ambrose, Ellender, et al., 1981 | Based on data from 328. to 437. K.; AC |
Antoine Equation Parameters
log10(P) = A − (B / (T + C))
P = vapor pressure (atm)
T = temperature (K)
View plot Requires a JavaScript / HTML 5 canvas capable browser.
Temperature (K) | A | B | C | Reference | Comment |
---|---|---|---|---|---|
345.54 to 401.49 | 4.73987 | 1679.869 | -59.832 | Dreisbach and Shrader, 1949 | Coefficents calculated by NIST from author's data. |
Enthalpy of sublimation
ΔsubH (kcal/mol) | Temperature (K) | Method | Reference | Comment |
---|---|---|---|---|
17.7 ± 0.2 | 233. | TE | Calis-Van Ginkel, Calis, et al., 1978 | Based on data from 225. to 238. K.; AC |
17.5 ± 0.2 | 233. | ME | Calis-Van Ginkel, Calis, et al., 1978 | AC |
Enthalpy of fusion
ΔfusH (kcal/mol) | Temperature (K) | Reference | Comment |
---|---|---|---|
2.548 | 252.7 | Domalski and Hearing, 1996 | See also Martin and Andon, 1982.; AC |
Enthalpy of phase transition
ΔHtrs (kcal/mol) | Temperature (K) | Initial Phase | Final Phase | Reference | Comment |
---|---|---|---|---|---|
2.5478 | 252.65 | crystaline, I | liquid | Martin and Andon, 1982 | DH |
Entropy of phase transition
ΔStrs (cal/mol*K) | Temperature (K) | Initial Phase | Final Phase | Reference | Comment |
---|---|---|---|---|---|
10.08 | 252.65 | crystaline, I | liquid | Martin and Andon, 1982 | DH |

Reaction thermochemistry data

Data compiled as indicated in comments:
B - John E. Bartmess
ALS - Hussein Y. Afeefy, Joel F. Liebman, and Stephen E. Stein
RCD - Robert C. Dunbar
Individual Reactions
By formula: C3H5O2- + H+ = C3H6O2
Quantity | Value | Units | Method | Reference | Comment |
---|---|---|---|---|---|
ΔrH° | 347.4 ± 2.2 | kcal/mol | G+TS | Caldwell, Renneboog, et al., 1989 | gas phase; B |
ΔrH° | 347.4 ± 2.9 | kcal/mol | G+TS | Cumming and Kebarle, 1978 | gas phase; B |
Quantity | Value | Units | Method | Reference | Comment |
ΔrG° | 340.4 ± 2.0 | kcal/mol | IMRE | Caldwell, Renneboog, et al., 1989 | gas phase; B |
ΔrG° | 340.3 ± 2.0 | kcal/mol | IMRE | Cumming and Kebarle, 1978 | gas phase; B |
By formula: I- + C3H6O2 = (I- • C3H6O2)
Quantity | Value | Units | Method | Reference | Comment |
---|---|---|---|---|---|
ΔrH° | 16.6 ± 1.0 | kcal/mol | TDAs | Caldwell and Kebarle, 1984 | gas phase; B |
Quantity | Value | Units | Method | Reference | Comment |
ΔrG° | 10.5 ± 1.0 | kcal/mol | TDAs | Caldwell and Kebarle, 1984 | gas phase; B |
+
= C9H11O2S-
By formula: C6H5S- + C3H6O2 = C9H11O2S-
Quantity | Value | Units | Method | Reference | Comment |
---|---|---|---|---|---|
ΔrH° | 20.00 ± 0.40 | kcal/mol | TDAs | Sieck and Meot-ner, 1989 | gas phase; B |
Quantity | Value | Units | Method | Reference | Comment |
ΔrG° | 12.4 ± 1.3 | kcal/mol | TDAs | Sieck and Meot-ner, 1989 | gas phase; B |
By formula: C2H6O + C3H6O2 = C5H10O2 + H2O
Quantity | Value | Units | Method | Reference | Comment |
---|---|---|---|---|---|
ΔrH° | -5.40 ± 0.10 | kcal/mol | Eqk | Essex and Sandholzer, 1938 | liquid phase; Reanalyzed by Cox and Pilcher, 1970, Original value = -5.627 kcal/mol; ALS |
By formula: C6H10O3 + H2O = 2C3H6O2
Quantity | Value | Units | Method | Reference | Comment |
---|---|---|---|---|---|
ΔrH° | -13.5 ± 0.1 | kcal/mol | Cm | Conn, Kistiakowsky, et al., 1942 | liquid phase; Heat of hydrolysis at 303 K; ALS |
By formula: H2 + C3H4O2 = C3H6O2
Quantity | Value | Units | Method | Reference | Comment |
---|---|---|---|---|---|
ΔrH° | -30.4 ± 0.2 | kcal/mol | Chyd | Skinner and Snelson, 1959 | liquid phase; solvent: Acetic acid; ALS |
By formula: C4H8O2 + H2O = CH4O + C3H6O2
Quantity | Value | Units | Method | Reference | Comment |
---|---|---|---|---|---|
ΔrH° | -14.38 ± 0.22 | kcal/mol | Eqk | Guthrie and Cullimore, 1980 | liquid phase; ALS |
+
+
= C3H8NO6-
By formula: NO3- + H2O + C3H6O2 = C3H8NO6-
Quantity | Value | Units | Method | Reference | Comment |
---|---|---|---|---|---|
ΔrG° | 3.90 ± 0.20 | kcal/mol | IMRE | Viidanoja, Reiner, et al., 2000 | gas phase; B |
By formula: CO3 + H2O + C3H6O2 = C4H8O6-
Quantity | Value | Units | Method | Reference | Comment |
---|---|---|---|---|---|
ΔrG° | 4.00 ± 0.20 | kcal/mol | IMRE | Viidanoja, Reiner, et al., 2000 | gas phase; B |
+
= C3H6NO5-
By formula: NO3- + C3H6O2 = C3H6NO5-
Quantity | Value | Units | Method | Reference | Comment |
---|---|---|---|---|---|
ΔrG° | 12.00 ± 0.20 | kcal/mol | IMRE | Viidanoja, Reiner, et al., 2000 | gas phase; B |
+
= C3H6NO4-
By formula: NO2- + C3H6O2 = C3H6NO4-
Quantity | Value | Units | Method | Reference | Comment |
---|---|---|---|---|---|
ΔrG° | 12.50 ± 0.20 | kcal/mol | IMRE | Viidanoja, Reiner, et al., 2000 | gas phase; B |
By formula: Na+ + C3H6O2 = (Na+ • C3H6O2)
Quantity | Value | Units | Method | Reference | Comment |
---|---|---|---|---|---|
ΔrH° | 28.2 ± 1.4 | kcal/mol | CIDT | Moision and Armentrout, 2002 | RCD |

Henry's Law data

Data compiled by: Rolf Sander
Henry's Law constant (water solution)
kH(T) = k°H exp(d(ln(kH))/d(1/T) ((1/T) - 1/(298.15 K)))
k°H = Henry's law constant for solubility in water at 298.15 K (mol/(kg*bar))
d(ln(kH))/d(1/T) = Temperature dependence constant (K)
k°H (mol/(kg*bar)) | d(ln(kH))/d(1/T) (K) | Method | Reference | Comment |
---|---|---|---|---|
5700. | M | N/A | ||
6200. | M | N/A | The value given here was measured at a liquid phase volume mixing ratio of 1 ppmv. missing citation found that the Henry's law constant changes at higher concentrations. | |
2200. | Q | N/A | ||
2300. | M | N/A |

Gas phase ion energetics data

Data evaluated as indicated in comments:
HL - Edward P. Hunter and Sharon G. Lias
L - Sharon G. Lias
Data compiled as indicated in comments:
B - John E. Bartmess
LL - Sharon G. Lias and Joel F. Liebman
LBLHLM - Sharon G. Lias, John E. Bartmess, Joel F. Liebman, John L. Holmes, Rhoda D. Levin, and W. Gary Mallard
LLK - Sharon G. Lias, Rhoda D. Levin, and Sherif A. Kafafi
RDSH - Henry M. Rosenstock, Keith Draxl, Bruce W. Steiner, and John T. Herron
Quantity | Value | Units | Method | Reference | Comment |
---|---|---|---|---|---|
IE (evaluated) | 10.44 ± 0.06 | eV | N/A | N/A | L |
Quantity | Value | Units | Method | Reference | Comment |
Proton affinity (review) | 190.5 | kcal/mol | N/A | Hunter and Lias, 1998 | HL |
Quantity | Value | Units | Method | Reference | Comment |
Gas basicity | 183.1 | kcal/mol | N/A | Hunter and Lias, 1998 | HL |
Ionization energy determinations
IE (eV) | Method | Reference | Comment |
---|---|---|---|
10.4 | EI | Arakawa, 1990 | LL |
10.51 | PI | Traeger, 1985 | LBLHLM |
10.41 | EI | Holmes, Fingas, et al., 1981 | LLK |
10.41 | EI | Holmes and Lossing, 1980 | LLK |
10.525 ± 0.003 | PI | Watanabe, Yokoyama, et al., 1974 | LLK |
10.54 | PE | Watanabe, Yokoyama, et al., 1973 | LLK |
10.44 ± 0.03 | PE | Thomas, 1972 | LLK |
10.24 ± 0.03 | PI | Watanabe, Nakayama, et al., 1962 | RDSH |
10.51 | PE | Benoit and Harrison, 1977 | Vertical value; LLK |
10.72 | PE | Kimura, Katsumata, et al., 1975 | Vertical value; LLK |
Appearance energy determinations
Ion | AE (eV) | Other Products | Method | Reference | Comment |
---|---|---|---|---|---|
CHO2+ | 12.6 | ? | EI | Arakawa, 1990 | LL |
CHO2+ | 12.84 | C2H5 | EI | Bernecker and Long, 1961 | RDSH |
C2H5+ | 12.4 | COOH | EI | Arakawa, 1990 | LL |
C2H5+ | 12.90 | ? | EI | Bernecker and Long, 1961 | RDSH |
C3H3O+ | 13.1 | ? | EI | Arakawa, 1990 | LL |
C3H4O+ | 10.9 | H2O | EI | Arakawa, 1990 | LL |
C3H4O+ | 11.57 | H2O | EI | Bernecker and Long, 1961 | RDSH |
C3H5O+ | 11.2 | OH | EI | Arakawa, 1990 | LL |
C3H5O+ | 11.00 | OH | PI | Traeger, 1985 | LBLHLM |
C3H5O+ | 12.20 | OH | EI | Bernecker and Long, 1961 | RDSH |
C3H5O2+ | 11.1 | H | EI | Arakawa, 1990 | LL |
C3H5O2+ | 11.70 | H | EI | Bernecker and Long, 1961 | RDSH |
De-protonation reactions
By formula: C3H5O2- + H+ = C3H6O2
Quantity | Value | Units | Method | Reference | Comment |
---|---|---|---|---|---|
ΔrH° | 347.4 ± 2.2 | kcal/mol | G+TS | Caldwell, Renneboog, et al., 1989 | gas phase; B |
ΔrH° | 347.4 ± 2.9 | kcal/mol | G+TS | Cumming and Kebarle, 1978 | gas phase; B |
Quantity | Value | Units | Method | Reference | Comment |
ΔrG° | 340.4 ± 2.0 | kcal/mol | IMRE | Caldwell, Renneboog, et al., 1989 | gas phase; B |
ΔrG° | 340.3 ± 2.0 | kcal/mol | IMRE | Cumming and Kebarle, 1978 | gas phase; B |

Ion clustering data

Data compiled as indicated in comments:
B - John E. Bartmess
RCD - Robert C. Dunbar
Clustering reactions
+
= C9H11O2S-
By formula: C6H5S- + C3H6O2 = C9H11O2S-
Quantity | Value | Units | Method | Reference | Comment |
---|---|---|---|---|---|
ΔrH° | 20.00 ± 0.40 | kcal/mol | TDAs | Sieck and Meot-ner, 1989 | gas phase; B |
Quantity | Value | Units | Method | Reference | Comment |
ΔrG° | 12.4 ± 1.3 | kcal/mol | TDAs | Sieck and Meot-ner, 1989 | gas phase; B |
By formula: I- + C3H6O2 = (I- • C3H6O2)
Quantity | Value | Units | Method | Reference | Comment |
---|---|---|---|---|---|
ΔrH° | 16.6 ± 1.0 | kcal/mol | TDAs | Caldwell and Kebarle, 1984 | gas phase; B |
Quantity | Value | Units | Method | Reference | Comment |
ΔrG° | 10.5 ± 1.0 | kcal/mol | TDAs | Caldwell and Kebarle, 1984 | gas phase; B |
+
= C3H6NO4-
By formula: NO2- + C3H6O2 = C3H6NO4-
Quantity | Value | Units | Method | Reference | Comment |
---|---|---|---|---|---|
ΔrG° | 12.50 ± 0.20 | kcal/mol | IMRE | Viidanoja, Reiner, et al., 2000 | gas phase; B |
+
= C3H6NO5-
By formula: NO3- + C3H6O2 = C3H6NO5-
Quantity | Value | Units | Method | Reference | Comment |
---|---|---|---|---|---|
ΔrG° | 12.00 ± 0.20 | kcal/mol | IMRE | Viidanoja, Reiner, et al., 2000 | gas phase; B |
+
+
= C3H8NO6-
By formula: NO3- + H2O + C3H6O2 = C3H8NO6-
Quantity | Value | Units | Method | Reference | Comment |
---|---|---|---|---|---|
ΔrG° | 3.90 ± 0.20 | kcal/mol | IMRE | Viidanoja, Reiner, et al., 2000 | gas phase; B |
By formula: Na+ + C3H6O2 = (Na+ • C3H6O2)
Quantity | Value | Units | Method | Reference | Comment |
---|---|---|---|---|---|
ΔrH° | 28.2 ± 1.4 | kcal/mol | CIDT | Moision and Armentrout, 2002 | RCD |

Normal alkane RI, polar column, temperature ramp

Data compiled by: NIST Mass Spectrometry Data Center, William E. Wallace, director

Column type CapillaryCapillaryCapillaryCapillaryCapillary
Active phase VF-Wax MSDB-WaxDB-WaxHP-InnowaxHP-Innowax
Column length (m) 60.60.30.50.30.
Carrier gas HeliumHeliumHeliumHeliumHelium
Substrate
Column diameter (mm) 0.250.250.250.200.25
Phase thickness (μm) 0.250.500.250.200.25
Tstart (C) 60.40.60.45.50.
Tend (C) 220.210.250.190.250.
Heat rate (K/min) 3.2.10.4.6.5
Initial hold (min) 5.5.2.2.1.5
Final hold (min) 25.70.10.50.10.
I 1552.1557.1493.1556.1540.
ReferenceDuarte, Dias, et al., 2010Moon and Shibamoto, 2009Guo, Wu, et al., 2008Soria, Sanz, et al., 2008Thakeow, Angeli, et al., 2008
Comment MSDC-RI MSDC-RI MSDC-RI MSDC-RI MSDC-RI
Column type CapillaryCapillaryCapillaryCapillaryCapillary
Active phase CP-Wax 52CBRTX-WaxDB-WaxDB-WaxDB-Wax
Column length (m) 30.30.30.30.30.
Carrier gas HeHeHeHeN2
Substrate
Column diameter (mm)  0.250.250.320.32
Phase thickness (μm) 0.320.50.250.250.25
Tstart (C) 50.40.40.40.40.
Tend (C) 220.220.230.230.230.
Heat rate (K/min) 6.10.4.4.6.
Initial hold (min) 2.5.2.2.2.
Final hold (min) 20.10.5.15.15.
I 1564.1523.1525.1525.1561.
ReferenceAudino, Alzogaray, et al., 2007Prososki, Etzel, et al., 2007Xu, Fan, et al., 2007Fan and Qian, 2006Fan and Qian, 2006, 2
Comment MSDC-RI MSDC-RI MSDC-RI MSDC-RI MSDC-RI
Column type CapillaryCapillaryCapillaryCapillaryCapillary
Active phase Carbowax 20MStabilwax DAZB-WaxZB-WaxDB-Wax
Column length (m) 50.60.30.30.60.
Carrier gas Helium HeliumHeliumHe
Substrate
Column diameter (mm) 0.250.250.320.320.25
Phase thickness (μm) 0.250.50.250.250.25
Tstart (C) 40.40.40.40.40.
Tend (C) 190.180.250.250.220.
Heat rate (K/min) 4.5.5.5.3.
Initial hold (min) 2.5.2.2.5.
Final hold (min) 30. 5.5.
I 1542.1565.1543.1552.1556.
Referencede la Fuente, Martinez-Castro, et al., 2005Nogueira, Lubachevsky, et al., 2005N/AN/ALópez, Ezpeleta, et al., 2004
Comment MSDC-RI MSDC-RI MSDC-RI MSDC-RI MSDC-RI
Column type CapillaryCapillaryCapillaryCapillaryCapillary
Active phase HP-InnowaxDB-WaxDB-WaxDB-WaxSupelcowax-10
Column length (m) 50.30.30.30.30.
Carrier gas HeHe  He
Substrate
Column diameter (mm) 0.20.250.250.250.25
Phase thickness (μm) 0.20.250.250.250.25
Tstart (C) 45.40.30.30.40.
Tend (C) 190.185.250.250.200.
Heat rate (K/min) 4.4.4.4.3.
Initial hold (min) 2.4.1.1.10.
Final hold (min) 50.20.
I 1558.1523.1537.1540.1528.
ReferenceSoria, Gonzalez, et al., 2004Lee and Noble, 2003Tanaka, Yamauchi, et al., 2003Tanaka, Yamauchi, et al., 2003Vichi, Castellote, et al., 2003
Comment MSDC-RI MSDC-RI MSDC-RI MSDC-RI MSDC-RI
Column type CapillaryCapillaryCapillaryCapillaryCapillary
Active phase Supelcowax-10Supelcowax-10DB-WaxFFAPHP-FFAP
Column length (m) 30.30.30.30.25.
Carrier gas HeHeHeHe
Substrate
Column diameter (mm) 0.250.250.250.320.32
Phase thickness (μm) 0.250.250.251.0.52
Tstart (C) 40.40.40.35.60.
Tend (C) 200.200.250.240.240.
Heat rate (K/min) 3.3.8.5.5.
Initial hold (min) 10.10.5.3.1.
Final hold (min)   5. 5.
I 1528.1531.1525.1525.1525.
ReferenceVichi, Pizzale, et al., 2003Vichi, Pizzale, et al., 2003, 2Fu, Yoon, et al., 2002Lecanu, Ducruet, et al., 2002Qian and Reineccius, 2002
Comment MSDC-RI MSDC-RI MSDC-RI MSDC-RI MSDC-RI
Column type CapillaryCapillaryCapillaryCapillaryCapillary
Active phase DB-WaxDB-WaxDB-WaxDB-WaxDB-Wax
Column length (m) 60.60.60.30.30.
Carrier gas He  HeHe
Substrate
Column diameter (mm) 0.250.320.250.250.25
Phase thickness (μm) 0.25  0.250.25
Tstart (C) 40.30.30.50.50.
Tend (C) 200.170.170.240.240.
Heat rate (K/min) 2.2.2.4.4.
Initial hold (min)  4.4.3.3.
Final hold (min)  60.30.10.10.
I 1521.1520.1520.1521.1535.
ReferenceWei, Mura, et al., 2001Buttery, Orts, et al., 1999Buttery and Ling, 1998Parada and Duque, 1998Parada and Duque, 1998
Comment MSDC-RI MSDC-RI MSDC-RI MSDC-RI MSDC-RI
Column type CapillaryCapillaryCapillaryCapillaryCapillary
Active phase InnowaxDB-WaxDB-WaxDB-WaxDB-Wax
Column length (m) 30.60.60.30.60.
Carrier gas  HeHe He
Substrate
Column diameter (mm) 0.250.250.250.250.25
Phase thickness (μm) 0.25  0.25
Tstart (C) 40.60.50.20.40.
Tend (C) 240.180.200.230.200.
Heat rate (K/min) 6.2.3.5.2.
Initial hold (min) 10.  1.2.
Final hold (min) 25. 40.
I 1550.1532.1547.1517.1541.
ReferencePetersen, Poll, et al., 1998Sekiwa, Kubota, et al., 1997Wada and Shibamoto, 1997Christensen and Reineccius, 1995Umano, Hagi, et al., 1995
Comment MSDC-RI MSDC-RI MSDC-RI MSDC-RI MSDC-RI
Column type CapillaryCapillaryCapillaryCapillaryCapillary
Active phase Carbowax 20MDB-WaxCarbowax 20MCarbowax 20MSupelcowax-10
Column length (m) 50.30.50.50.60.
Carrier gas HeHeHeHeHe
Substrate
Column diameter (mm) 0.250.250.330.250.25
Phase thickness (μm)     0.25
Tstart (C) 60.60.60.60.40.
Tend (C) 180.240.200.180.175.
Heat rate (K/min) 2.3.3.2.1.
Initial hold (min) 4.10. 4.5.
Final hold (min)
I 1491.1490.1510.1491.1547.
ReferenceKawakami, Kobayashi, et al., 1993Hatsuko, Kazuko, et al., 1992Vernin, Metzger, et al., 1992Kawakami and Kobayashi, 1991Hsieh, Williams, et al., 1989
Comment MSDC-RI MSDC-RI MSDC-RI MSDC-RI MSDC-RI
Column type Capillary
Active phase FFAP
Column length (m) 50.
Carrier gas He
Substrate
Column diameter (mm) 0.28
Phase thickness (μm)
Tstart (C) 60.
Tend (C) 240.
Heat rate (K/min) 2.
Initial hold (min) 5.
Final hold (min)
I 1525.
ReferenceVernin, Metzger, et al., 1988
Comment MSDC-RI

Normal alkane RI, non-polar column, custom temperature program

Data compiled by: NIST Mass Spectrometry Data Center, William E. Wallace, director

Column type CapillaryCapillaryCapillaryCapillaryCapillary
Active phase SLB-5 MSSLB-5 MSRTX-5 MSHP-5MSHP-5
Column length (m) 30.30.30.30.50.
Carrier gas HeliumHeliumHeliumHe
Substrate
Column diameter (mm) 0.250.250.250.250.32
Phase thickness (μm) 0.250.250.250.251.05
Program not specifiednot specifiednot specified40C(3min) => 2C/min => 180C => 10C/min => 250C(5min)40C(10min) => 5C/min => 200C => 20C/min => 250C(5min)
I 725.739.668.740.693.
ReferenceMondello, 2012Mondello, 2012Mebazaa, Mahmoudi, et al., 2009Alissandrakis, Kibaris, et al., 2005Garcia-Estaban, Ansorena, et al., 2004
Comment MSDC-RI MSDC-RI MSDC-RI MSDC-RI MSDC-RI
Column type CapillaryCapillaryCapillaryCapillaryCapillary
Active phase DB-5SE-30SPB-5HP-5DB-5
Column length (m) 50. 60.50.50.
Carrier gas    HeHe
Substrate
Column diameter (mm) 0.32 0.320.320.32
Phase thickness (μm) 1.05 1.0.520.25
Program 40C(10min) => 5C/min => 200C => 20C/min => 250C (5min)not specifiednot specified35 0C 10 0C/min -> 200 0C (20 min) 5 0C/min -> 230 0C (50 min)40C(10min) => 3C/min => 95C => 10C/min => 270C(10min)
I 693.710.681.702.700.
ReferenceGarcia-Estaban, Ansorena, et al., 2004, 2Vinogradov, 2004Begnaud, Pérès, et al., 2003Timón, Ventanas, et al., 1998Mateo, Aguirrezábal, et al., 1997
Comment MSDC-RI MSDC-RI MSDC-RI MSDC-RI MSDC-RI
Column type CapillaryCapillaryCapillaryCapillaryCapillary
Active phase DB-5DB-5DB-1DB-1SE-54
Column length (m) 50.50.60.60.50.
Carrier gas HeHe
Substrate
Column diameter (mm) 0.320.320.320.320.32
Phase thickness (μm) 0.250.250.250.25
Program 40C (10min) => 3C/min => 95C => 10C/min => 270C (10min)40C (10min) => 3C/min => 95C => 10C/min => 270C (10min)not specified3 min at 5 C; 5 - 50 C at 3 deg/min; 50 - 220 C at 5 deg/min35C(5min) => 8C/min => 200C => 2C/min => 250C
I 718.710.716.716.680.
ReferenceMateo and Zumalacárregui, 1996Mateo and Zumalacárregui, 1996Ciccioli, Cecinato, et al., 1994Ciccioli, Brancaleoni, et al., 1993Suzuki and Bailey, 1985
Comment MSDC-RI MSDC-RI MSDC-RI MSDC-RI MSDC-RI

Van Den Dool and Kratz RI, non-polar column, temperature ramp

Data compiled by: NIST Mass Spectrometry Data Center, William E. Wallace, director

Column type CapillaryCapillaryCapillaryCapillaryCapillary
Active phase SPB-5CP Sil 5 CBCP-Sil 8CB-MSSPB-1SPB-5
Column length (m) 60.30.60.30.60.
Carrier gas  H2 HeHe
Substrate
Column diameter (mm) 0.320.250.250.320.32
Phase thickness (μm) 1.0.250.254.1.
Tstart (C) 40.60.40.45.40.
Tend (C) 230.280.280.240.200.
Heat rate (K/min) 3.2.4.5.3.
Initial hold (min) 2.10.2.13.5.
Final hold (min) 10.40. 5.2.
I 700.741.745.684.721.
ReferenceEngel and Ratel, 2007Pino, Marbot, et al., 2002Bruna, Hierro, et al., 2001Larráyoz, Addis, et al., 2001Verdier-Metz., Coulon, et al., 1998
Comment MSDC-RI MSDC-RI MSDC-RI MSDC-RI MSDC-RI

References

Lebedeva, 1964
Lebedeva, N.D.,
Heats of combustion of monocarboxylic acids,
Russ. J. Phys. Chem. (Engl. Transl.), 1964, 38, 1435-1437. [all data]
Konicek and Wadso, 1970
Konicek, J.; Wadso, I.,
Enthalpies of vaporization of organic compounds. VII. Some carboxylic acids,
Acta Chem. Scand., 1970, 24, 2612-26. [all data]
Schjanberg, 1935
Schjanberg, E.,
Die Verbrennungswarmen und die Refraktionsdaten einiger chlorsubstituierter Fettsauren und Ester.,
Z. Phys. Chem. Abt. A, 1935, 172, 197-233. [all data]
Martin and Andon, 1982
Martin, J.F.; Andon, R.J.L.,
Thermodynamic properties of organic oxygen compounds. Part LII. Molar heat capacity of ethanoic, propanoic, and butanoic acids,
J. Chem. Thermodynam., 1982, 14, 679-688. [all data]
Biros, Sikora, et al., 1982
Biros, J.; Sikora, A.; Zivny, A.; Pouchly, J.,
Heat capacity of monomer models of some hydrophilic polymers in aqueous solution from 20° to 60°C,
Collect Czech. Chem. Commun., 1982, 47(10), 2692-2701. [all data]
Woycicka and Kalinowska, 1978
Woycicka, M.; Kalinowska, B.,
Excess entahlpy and heat capacities of diluted propionic acid solutions in n-heptane, Bull. Acad. Pol. Sci.,
Ser. Sci. Chim., 1978, 26, 371-375. [all data]
Konicek and Wadso, 1971
Konicek, J.; Wadso, I.,
Thermochemical properties of some carboxylic acids, amines and N-substituted amides in aqueous solution,
Acta Chem. Scand., 1971, 25, 1541-1551. [all data]
Radulescu and Jula, 1934
Radulescu, D.; Jula, O.,
Beiträge zur Bestimmung der Abstufung der Polarität des Aminstickstoffes in den organischen Verbindungen,
Z. Phys. Chem., 1934, B26, 390-393. [all data]
Martin and Andon, 1982, 2
Martin, J.F.; Andon, R.J.L.,
Thermodynamic properties of organic oxygen compounds. Part LII. Molar heat capacity of ethanoic, propanoic, and butanoic acids.,
J. Chem. Thermodyn., 1982, 14, 679-88. [all data]
Andereya and Chase, 1990
Andereya, E.; Chase, J.D.,
Chem. Eng. Technol., 1990, 13, 304-12. [all data]
Ambrose and Ghiassee, 1987
Ambrose, D.; Ghiassee, N.B.,
Vapor Pressures and Critical Temperatures and Critical Pressures of Some Alkanoic Acids: C1 to C10,
J. Chem. Thermodyn., 1987, 19, 505. [all data]
D'Souza and Teja, 1987
D'Souza, R.; Teja, A.S.,
The prediction of the vapor pressures of carboxylic acids,
Chem. Eng. Commun., 1987, 61, 13. [all data]
Efremova and Sokolova, 1972
Efremova, G.D.; Sokolova, E.S.,
Boundary curve and critical parameters of propionic acid,
Russ. J. Phys. Chem. (Engl. Transl.), 1972, 46, 1084. [all data]
Vespigniani, 1903
Vespigniani, G.R.,
Gazz. Chim. Ital., 1903, 33, 73-8. [all data]
Anonymous, 1928
Anonymous, B.,
International Critical Tables of Numerical Data, Phys., Chem. Technol. Vol. III, Washburn, E. W., Ed., McGraw-Hill, NY, 1928. [all data]
Stephenson and Malanowski, 1987
Stephenson, Richard M.; Malanowski, Stanislaw,
Handbook of the Thermodynamics of Organic Compounds, 1987, https://doi.org/10.1007/978-94-009-3173-2
. [all data]
Tamir, Dragoescu, et al., 1983
Tamir, Abraham; Dragoescu, Claudia; Apelblat, Alexander; Wisniak, Jaime,
Heats of vaporization and vapor-liquid equilibria in associated solutions containing formic acid, acetic acid, propionic acid and carbon tetrachloride,
Fluid Phase Equilibria, 1983, 10, 1, 9-42, https://doi.org/10.1016/0378-3812(83)80002-8
. [all data]
Ambrose, Ellender, et al., 1981
Ambrose, D.; Ellender, J.H.; Gundry, H.A.; Lee, D.A.; Townsend, R.,
Thermodynamic properties of organic oxygen compounds LI. The vapour pressures of some esters and fatty acids,
The Journal of Chemical Thermodynamics, 1981, 13, 8, 795-802, https://doi.org/10.1016/0021-9614(81)90069-0
. [all data]
Dreisbach and Shrader, 1949
Dreisbach, R.R.; Shrader, S.A.,
Vapor Pressure--Temperature Data on Some Organic Compounds,
Ind. Eng. Chem., 1949, 41, 12, 2879-2880, https://doi.org/10.1021/ie50480a054
. [all data]
Calis-Van Ginkel, Calis, et al., 1978
Calis-Van Ginkel, C.H.D.; Calis, G.H.M.; Timmermans, C.W.M.; de Kruif, C.G.; Oonk, H.A.J.,
Enthalpies of sublimation and dimerization in the vapour phase of formic, acetic, propanoic, and butanoic acids,
The Journal of Chemical Thermodynamics, 1978, 10, 11, 1083-1088, https://doi.org/10.1016/0021-9614(78)90082-4
. [all data]
Domalski and Hearing, 1996
Domalski, Eugene S.; Hearing, Elizabeth D.,
Heat Capacities and Entropies of Organic Compounds in the Condensed Phase. Volume III,
J. Phys. Chem. Ref. Data, 1996, 25, 1, 1, https://doi.org/10.1063/1.555985
. [all data]
Caldwell, Renneboog, et al., 1989
Caldwell, G.; Renneboog, R.; Kebarle, P.,
Gas Phase Acidities of Aliphatic Carboxylic Acids, Based on Measurements of Proton Transfer Equilibria,
Can. J. Chem., 1989, 67, 4, 661, https://doi.org/10.1139/v89-092
. [all data]
Cumming and Kebarle, 1978
Cumming, J.B.; Kebarle, P.,
Summary of gas phase measurements involving acids AH. Entropy changes in proton transfer reactions involving negative ions. Bond dissociation energies D(A-H) and electron affinities EA(A),
Can. J. Chem., 1978, 56, 1. [all data]
Caldwell and Kebarle, 1984
Caldwell, G.; Kebarle, P.,
Binding energies and structural effects in halide anion-ROH and -RCOOH complexes from gas phase equilibria measurements,
J. Am. Chem. Soc., 1984, 106, 967. [all data]
Sieck and Meot-ner, 1989
Sieck, L.W.; Meot-ner, M.,
Ionic Hydrogen Bond and Ion Solvation. 8. RS-..HOR Bond Strengths. Correlation with Acidities.,
J. Phys. Chem., 1989, 93, 4, 1586, https://doi.org/10.1021/j100341a079
. [all data]
Essex and Sandholzer, 1938
Essex, H.; Sandholzer, M.,
The free energy of formation of ethyl propionate,
J. Phys. Chem., 1938, 42, 317-333. [all data]
Cox and Pilcher, 1970
Cox, J.D.; Pilcher, G.,
Thermochemistry of Organic and Organometallic Compounds, Academic Press, New York, 1970, 1-636. [all data]
Conn, Kistiakowsky, et al., 1942
Conn, J.B.; Kistiakowsky, G.B.; Roberts, R.M.; Smith, E.A.,
Heats of organic reactions. XIII. Heats of hydrolysis of some acid anhydrides,
J. Am. Chem. Soc., 1942, 64, 1747-17. [all data]
Skinner and Snelson, 1959
Skinner, H.A.; Snelson, A.,
Heats of hydrogenation Part 3.,
Trans. Faraday Soc., 1959, 55, 405-407. [all data]
Guthrie and Cullimore, 1980
Guthrie, J.P.; Cullimore, P.A.,
Effect of the acyl substituent on the equilibrium constant for hydration of esters,
Can. J. Chem., 1980, 58, 1281-1294. [all data]
Viidanoja, Reiner, et al., 2000
Viidanoja, J.; Reiner, T.; Kiendler, A.; Grimm, F.; Arnold, F.,
Laboratory investigations of negative ion molecule reactions of propionic, butyric, glyoxylic, pyruvic, and pinonic acids,
Int. J. Mass Spectrom., 2000, 194, 1, 53-68, https://doi.org/10.1016/S1387-3806(99)00172-4
. [all data]
Moision and Armentrout, 2002
Moision, R.M.; Armentrout, P.B.,
Experimental and Theoretical Dissection of Sodium Cation/Glycine Interactions,
J. Phys. Chem A, 2002, 106, 43, 10350, https://doi.org/10.1021/jp0216373
. [all data]
Hunter and Lias, 1998
Hunter, E.P.; Lias, S.G.,
Evaluated Gas Phase Basicities and Proton Affinities of Molecules: An Update,
J. Phys. Chem. Ref. Data, 1998, 27, 3, 413-656, https://doi.org/10.1063/1.556018
. [all data]
Arakawa, 1990
Arakawa, R.,
Time-resolved dissociation of ionized propanoic acid,
Bull. Chem. Soc. Jpn., 1990, 61, 754. [all data]
Traeger, 1985
Traeger, J.C.,
Heat of formation for the propanoyl cation by photoionization mass spectrometry,
Org. Mass Spectrom., 1985, 20, 223. [all data]
Holmes, Fingas, et al., 1981
Holmes, J.L.; Fingas, M.; Lossing, F.P.,
Towards a general scheme for estimating the heats of formation of organic ions in the gas phase. Part I. Odd-electron cations,
Can. J. Chem., 1981, 59, 80. [all data]
Holmes and Lossing, 1980
Holmes, J.L.; Lossing, F.P.,
Gas-phase heats of formation of keto and enol ions of carbonyl compounds.,
J. Am. Chem. Soc., 1980, 102, 1591. [all data]
Watanabe, Yokoyama, et al., 1974
Watanabe, I.; Yokoyama, Y.; Ikeda, S.,
Vibrational structures in the He(I) photoelectron spectra of carboxylic acids,
Bull. Chem. Soc. Jpn., 1974, 47, 627. [all data]
Watanabe, Yokoyama, et al., 1973
Watanabe, I.; Yokoyama, Y.; Ikeda, S.,
Lone pair ionization potentials of carboxylic acids determined by He(I) photoelectron spectroscopy,
Bull. Chem. Soc. Jpn., 1973, 46, 1959. [all data]
Thomas, 1972
Thomas, R.K.,
Photoelectron spectroscopy of hydrogen-bonded systems: spectra of monomers, dimers and mixed complexes of carboxylic acides,
Proc. R. Soc. London A:, 1972, 331, 249. [all data]
Watanabe, Nakayama, et al., 1962
Watanabe, K.; Nakayama, T.; Mottl, J.,
Ionization potentials of some molecules,
J. Quant. Spectry. Radiative Transfer, 1962, 2, 369. [all data]
Benoit and Harrison, 1977
Benoit, F.M.; Harrison, A.G.,
Predictive value of proton affinity. Ionization energy correlations involving oxygenated molecules,
J. Am. Chem. Soc., 1977, 99, 3980. [all data]
Kimura, Katsumata, et al., 1975
Kimura, K.; Katsumata, S.; Yamazaki, T.; Wakabayashi, H.,
UV photoelectron spectra and sum rule consideration; out-of-plane orbitals of unsaturated compounds with planar-skeleton structure,
J. Electron Spectrosc. Relat. Phenom., 1975, 6, 41. [all data]
Bernecker and Long, 1961
Bernecker, R.R.; Long, F.,
Some organic positive ions and their parent radicals and molecules,
J. Phys. Chem., 1961, 65, 1565. [all data]