Acetic acid, bromo-
- Formula: C2H3BrO2
- Molecular weight: 138.948
- IUPAC Standard InChIKey: KDPAWGWELVVRCH-UHFFFAOYSA-N
- CAS Registry Number: 79-08-3
- Chemical structure:
View 3d structure (requires JavaScript / HTML 5) - Other names: α-Bromoacetic acid; Bromoacetic acid; Bromoethanoic acid; Monobromoacetic acid; To NTU; CH2BrCOOH; Acide bromacetique; α-Bromoethanoic acid; Kyselina bromoctova; Monobromessigsaeure; UN 1938; 2-Bromoacetic acid; Acetic acid, 2-bromo-; NSC 141

Gas phase ion energetics data

Data compiled as indicated in comments:
B - John E. Bartmess
LLK - Sharon G. Lias, Rhoda D. Levin, and Sherif A. Kafafi
LL - Sharon G. Lias and Joel F. Liebman
LBLHLM - Sharon G. Lias, John E. Bartmess, Joel F. Liebman, John L. Holmes, Rhoda D. Levin, and W. Gary Mallard
Ionization energy determinations
IE (eV) | Method | Reference | Comment |
---|---|---|---|
10.4 | PE | Watanabe, Yokoyama, et al., 1973 | LLK |
11.0 | PE | Watanabe, Yokoyama, et al., 1973 | Vertical value; LLK |
Appearance energy determinations
Ion | AE (eV) | Other Products | Method | Reference | Comment |
---|---|---|---|---|---|
CHO2+ | 12.12 | CH2Br | EI | Holmes and Lossing, 1988 | LL |
CH3Br+ | 11.36 ± 0.05 | CO2 | EI | Holmes, Lossing, et al., 1983 | LBLHLM |
De-protonation reactions
C2H2BrO2- + =
By formula: C2H2BrO2- + H+ = C2H3BrO2
Quantity | Value | Units | Method | Reference | Comment |
---|---|---|---|---|---|
ΔrH° | 334.8 ± 2.3 | kcal/mol | G+TS | Caldwell, Renneboog, et al., 1989 | gas phase; B |
ΔrH° | 334.0 ± 3.1 | kcal/mol | G+TS | Cumming and Kebarle, 1978 | gas phase; B |
Quantity | Value | Units | Method | Reference | Comment |
ΔrG° | 328.2 ± 2.0 | kcal/mol | IMRE | Caldwell, Renneboog, et al., 1989 | gas phase; B |
ΔrG° | 327.4 ± 2.0 | kcal/mol | IMRE | Cumming and Kebarle, 1978 | gas phase; B |

Phase change data

Data compiled as indicated in comments:
BS - Robert L. Brown and Stephen E. Stein
AC - William E. Acree, Jr., James S. Chickos

Quantity Value Units Method Reference Comment
Tboil479.2KN/AAldrich Chemical Company Inc., 1990BS
Tboil481.2KN/AWeast and Grasselli, 1989BS
Tboil481.KN/ABuckingham and Donaghy, 1982BS
Quantity Value Units Method Reference Comment
Tfus323.KN/ABuckingham and Donaghy, 1982BS
Quantity Value Units Method Reference Comment
Δsub83.5 ± 3.0kJ/molMELagoa, Diogo, et al., 2001AC

Enthalpy of vaporization

ΔvapH (kJ/mol) Temperature (K) Method Reference Comment
57.2342.AStephenson and Malanowski, 1987Based on data from 327. - 481. K.; AC

Enthalpy of fusion

ΔfusH (kJ/mol) Temperature (K) Method Reference Comment
13.9319.2DSCLagoa, Diogo, et al., 2001AC

Reaction thermochemistry data

Data compiled by: John E. Bartmess

Individual Reactions

C2H2BrO2- + Hydrogen cation = Acetic acid, bromo-

By formula: C2H2BrO2- + H+ = C2H3BrO2

Quantity Value Units Method Reference Comment
Δr1401. ± 9.6kJ/molG+TSCaldwell, Renneboog, et al., 1989gas phase
Δr1397. ± 13.kJ/molG+TSCumming and Kebarle, 1978gas phase
Quantity Value Units Method Reference Comment
Δr1373. ± 8.4kJ/molIMRECaldwell, Renneboog, et al., 1989gas phase
Δr1370. ± 8.4kJ/molIMRECumming and Kebarle, 1978gas phase

References

Watanabe, Yokoyama, et al., 1973
Watanabe, I.; Yokoyama, Y.; Ikeda, S.,
Lone pair ionization potentials of carboxylic acids determined by He(I) photoelectron spectroscopy,
Bull. Chem. Soc. Jpn., 1973, 46, 1959. [all data]
Holmes and Lossing, 1988
Holmes, J.L.; Lossing, F.P.,
Heats of formation and bond dissociation energies in halogen-substituted methyl and ethyl radicals,
J. Am. Chem. Soc., 1988, 110, 7343. [all data]
Holmes, Lossing, et al., 1983
Holmes, J.L.; Lossing, F.P.; Terlouw, J.K.; Burgers, P.C.,
Novel gas-phase ions. The radical cations [CH2XH]+. (X = F, Cl, Br, I, OH, NH2, SH) and [CH2CH2NH3]+.,
Can. J. Chem., 1983, 61, 2305. [all data]
Caldwell, Renneboog, et al., 1989
Caldwell, G.; Renneboog, R.; Kebarle, P.,
Gas Phase Acidities of Aliphatic Carboxylic Acids, Based on Measurements of Proton Transfer Equilibria,
Can. J. Chem., 1989, 67, 4, 661, https://doi.org/10.1139/v89-092
. [all data]
Cumming and Kebarle, 1978
Cumming, J.B.; Kebarle, P.,
Summary of gas phase measurements involving acids AH. Entropy changes in proton transfer reactions involving negative ions. Bond dissociation energies D(A-H) and electron affinities EA(A),
Can. J. Chem., 1978, 56, 1. [all data]