Acetyl chloride, chloro-
- Formula: C2H2Cl2O
- Molecular weight: 112.943
- IUPAC Standard InChIKey: VGCXGMAHQTYDJK-UHFFFAOYSA-N
- CAS Registry Number: 79-04-9
- Chemical structure:
View 3d structure (requires JavaScript / HTML 5) - Other names: α-Chloroacetyl chloride; Chloracetyl chloride; Chloroacetic acid chloride; Chloroacetic chloride; Chloroacetyl chloride; Monochloroacetyl chloride; CH2ClCOCl; Chloroethanoyl chloride; Chlorid kyseliny chloroctove; Chlorure de chloracetyle; UN 1752; Acetyl chloride, 2-chloro-

Gas phase thermochemistry data

Data compiled by: Hussein Y. Afeefy, Joel F. Liebman, and Stephen E. Stein
Quantity | Value | Units | Method | Reference | Comment |
---|---|---|---|---|---|
ΔfH°gas | -246. ± 8.8 | kJ/mol | Cm | Pritchard and Skinner, 1950 | Reanalyzed by Cox and Pilcher, 1970, Original value = -260. kJ/mol; Heat of hydrolysis at 298 K |

Condensed phase thermochemistry data

Data compiled by: Hussein Y. Afeefy, Joel F. Liebman, and Stephen E. Stein
Quantity | Value | Units | Method | Reference | Comment |
---|---|---|---|---|---|
ΔfH°liquid | -285. ± 8.4 | kJ/mol | Cm | Pritchard and Skinner, 1950 | Reanalyzed by Cox and Pilcher, 1970, Original value = -293.4 kJ/mol; Heat of hydrolysis at 298 K |

Phase change data

Data compiled as indicated in comments:
BS - Robert L. Brown and Stephen E. Stein
TRC - Thermodynamics Research Center, NIST Boulder Laboratories, Chris Muzny director
AC - William E. Acree, Jr., James S. Chickos
Quantity | Value | Units | Method | Reference | Comment |
---|---|---|---|---|---|
Tboil | 379. ± 3. | K | AVG | N/A | Average of 14 values; Individual data points |
Quantity | Value | Units | Method | Reference | Comment |
Tfus | 377. | K | N/A | Tulecki and Osinska, 1976 | TRC |
Tfus | 251.38 | K | N/A | McDonald, Shrader, et al., 1959 | Uncertainty assigned by TRC = 0.07 K; TRC |
Enthalpy of vaporization
ΔvapH (kJ/mol) | Temperature (K) | Method | Reference | Comment |
---|---|---|---|---|
45.0 | 268. | A | Stephenson and Malanowski, 1987 | Based on data from 253. to 379. K. See also Dykyj, 1970.; AC |
40.8 | 316. | N/A | McDonald, Shrader, et al., 1959, 2 | Based on data from 301. to 380. K.; AC |
44.1 | 305. | N/A | Kireev and Popov, 1935 | Based on data from 290. to 373. K.; AC |
Antoine Equation Parameters
log10(P) = A − (B / (T + C))
P = vapor pressure (bar)
T = temperature (K)
View plot Requires a JavaScript / HTML 5 canvas capable browser.
Temperature (K) | A | B | C | Reference |
---|---|---|---|---|
301.48 to 380.22 | 4.25901 | 1331.94 | -65.974 | McDonald, Shrader, et al., 1959, 2 |

Reaction thermochemistry data

Data compiled by: Hussein Y. Afeefy, Joel F. Liebman, and Stephen E. Stein
Individual Reactions
By formula: H2O + C2H2Cl2O = HCl + C2H3ClO2
Quantity | Value | Units | Method | Reference | Comment |
---|---|---|---|---|---|
ΔrH° | -93.51 | kJ/mol | Cm | Pritchard and Skinner, 1950 | liquid phase; Heat of hydrolysis at 298 K |

Gas phase ion energetics data

Data compiled by: Sharon G. Lias, Rhoda D. Levin, and Sherif A. Kafafi
Ionization energy determinations
IE (eV) | Method | Reference | Comment |
---|---|---|---|
10.30 | PE | Katsumata and Kimura, 1975 | Vertical value |

Normal alkane RI, non-polar column, temperature ramp

Column type | Active phase | I | Reference | Comment |
---|---|---|---|---|
Capillary | OV-101 | 622. | Zenkevich, 2005 | 25. m/0.20 mm/0.10 μm, N2/He, 6. K/min; Tstart: 50. C; Tend: 250. C |

Normal alkane RI, non-polar column, custom temperature program

Column type | Active phase | I | Reference | Comment |
---|---|---|---|---|
Capillary | Polydimethyl siloxanes | 622. | Zenkevich, 2001 | Program: not specified |

References

Pritchard and Skinner, 1950
Pritchard, H.O.; Skinner, H.A.,
The heats of hydrolysis of the chloro-substituted acetyl chlorides,
J. Chem. Soc., 1950, 272-276. [all data]
Cox and Pilcher, 1970
Cox, J.D.; Pilcher, G.,
Thermochemistry of Organic and Organometallic Compounds, Academic Press, New York, 1970, 1-636. [all data]
Tulecki and Osinska, 1976
Tulecki, J.; Osinska, Z.,
Search for New Radioactive Agent XXIV. Synthesis of Some Sulfenomides Derived from Phenthiazine,
Ann. Phar, (Poznan), 1976, 12, 11-12. [all data]
McDonald, Shrader, et al., 1959
McDonald, R.A.; Shrader, S.A.; Stull, D.R.,
Vapor Pressures and Freezing Points of 30 Organics,
J. Chem. Eng. Data, 1959, 4, 311. [all data]
Stephenson and Malanowski, 1987
Stephenson, Richard M.; Malanowski, Stanislaw,
Handbook of the Thermodynamics of Organic Compounds, 1987, https://doi.org/10.1007/978-94-009-3173-2
. [all data]
Dykyj, 1970
Dykyj, J.,
Petrochemica, 1970, 10, 2, 51. [all data]
McDonald, Shrader, et al., 1959, 2
McDonald, R.A.; Shrader, S.A.; Stull, D.R.,
Vapor Pressures and Freezing Points of Thirty Pure Organic Compounds.,
J. Chem. Eng. Data, 1959, 4, 4, 311-313, https://doi.org/10.1021/je60004a009
. [all data]
Kireev and Popov, 1935
Kireev, V.A.; Popov, A.A.,
Russ. J. Gen. Chem., 1935, 5, 1399. [all data]
Katsumata and Kimura, 1975
Katsumata, S.; Kimura, K.,
Photoelectron spectra and sum rule consideration. Effect of chlorine substitution on ionization energies for chloroethanes, chloroacetaldehydes and chloroacetyl chlorides,
J. Electron Spectrosc. Relat. Phenom., 1975, 6, 309. [all data]
Zenkevich, 2005
Zenkevich, I.G.,
Experimentally measured retention indices., 2005. [all data]
Zenkevich, 2001
Zenkevich, I.G.,
Encyclopedia of Chromatography. Derivatization of Amines, Amino Acids, Amides and Imides for GC Analysis, Marcel Dekker, Inc, New York - Basel, 2001, 224. [all data]