Ethane, 1,1,2-trichloro-
- Formula: C2H3Cl3
- Molecular weight: 133.404
- IUPAC Standard InChIKey: UBOXGVDOUJQMTN-UHFFFAOYSA-N
- CAS Registry Number: 79-00-5
- Chemical structure:
View 3d structure (requires JavaScript / HTML 5) - Other names: β-T; β-Trichloroethane; Trichloroethane; Vinyl trichloride; 1,1,2-Trichloroethane; 1,2,2-Trichloroethane; CHCl2CH2Cl; Ethane trichloride; NCI-C04579; Trojchloroetan(1,1,2); Rcra waste number U227; Rcra waste number U359; 1,1,2-Trichlorethane; NSC 405074

Gas phase thermochemistry data

Data compiled as indicated in comments:
DRB - Donald R. Burgess, Jr.
ALS - Hussein Y. Afeefy, Joel F. Liebman, and Stephen E. Stein
Quantity | Value | Units | Method | Reference | Comment |
---|---|---|---|---|---|
ΔfH°gas | -148. ± 4. | kJ/mol | Review | Manion, 2002 | derived from recommended ΔfHliquid° and ΔvapH°; DRB |
ΔfH°gas | -148.2 ± 4.4 | kJ/mol | Ccr | Papina and Kolesov, 1987 | Hf_HCl.600H2O; ALS |

Condensed phase thermochemistry data

Data compiled as indicated in comments:
DRB - Donald R. Burgess, Jr.
ALS - Hussein Y. Afeefy, Joel F. Liebman, and Stephen E. Stein
DH - Eugene S. Domalski and Elizabeth D. Hearing
Quantity | Value | Units | Method | Reference | Comment |
---|---|---|---|---|---|
ΔfH°liquid | -188. ± 4. | kJ/mol | Review | Manion, 2002 | weighted average of several measurements; DRB |
ΔfH°liquid | -188.5 ± 4.4 | kJ/mol | Ccr | Papina and Kolesov, 1987 | Hf_HCl.600H2O; ALS |
Quantity | Value | Units | Method | Reference | Comment |
ΔcH°liquid | -1098.1 ± 4.4 | kJ/mol | Ccr | Papina and Kolesov, 1987 | Hf_HCl.600H2O; ALS |
Constant pressure heat capacity of solid
Cp,solid (J/mol*K) | Temperature (K) | Reference | Comment |
---|---|---|---|
143.1 | 251.7 | Crowe and Smyth, 1950 | T = 117 to 252 K. Value is unsmoothed experimental datum.; DH |

Phase change data

Data compiled as indicated in comments:
BS - Robert L. Brown and Stephen E. Stein
TRC - Thermodynamics Research Center, NIST Boulder Laboratories, Chris Muzny director
AC - William E. Acree, Jr., James S. Chickos
DRB - Donald R. Burgess, Jr.
ALS - Hussein Y. Afeefy, Joel F. Liebman, and Stephen E. Stein
DH - Eugene S. Domalski and Elizabeth D. Hearing
Quantity | Value | Units | Method | Reference | Comment |
---|---|---|---|---|---|
Tboil | 386.8 ± 0.9 | K | AVG | N/A | Average of 12 out of 13 values; Individual data points |
Quantity | Value | Units | Method | Reference | Comment |
Tfus | 237.9 | K | N/A | Golovanova and Kolesov, 1984 | Uncertainty assigned by TRC = 0.2 K; TRC |
Tfus | 236.6 | K | N/A | Dreisbach, 1955 | Uncertainty assigned by TRC = 0.02 K; TRC |
Tfus | 236.5 | K | N/A | Timmermans and Hennaut-Roland, 1955 | Uncertainty assigned by TRC = 0.2 K; TRC |
Tfus | 236.58 | K | N/A | Dreisbach and Martin, 1949 | Uncertainty assigned by TRC = 0.05 K; TRC |
Quantity | Value | Units | Method | Reference | Comment |
Ttriple | 237.1 | K | N/A | Crowe and Smyth, 1950, 2 | Uncertainty assigned by TRC = 0.2 K; TRC |
Quantity | Value | Units | Method | Reference | Comment |
Tc | 602. | K | N/A | Majer and Svoboda, 1985 | |
Quantity | Value | Units | Method | Reference | Comment |
ΔvapH° | 40.2 ± 0.1 | kJ/mol | AVG | N/A | Average of 6 values; Individual data points |
Enthalpy of vaporization
ΔvapH (kJ/mol) | Temperature (K) | Method | Reference | Comment |
---|---|---|---|---|
34.82 | 386.9 | N/A | Majer and Svoboda, 1985 | |
38.6 | 331. | A | Stephenson and Malanowski, 1987 | Based on data from 316. to 384. K.; AC |
38.2 | 317. | N/A | Stephenson and Malanowski, 1987 | Based on data from 302. to 428. K. See also Dykyj, 1970.; AC |
38.29 ± 0.63 | 330.33 | V | Williamson and Harrison, 1957 | ALS |
38.3 | 338. | N/A | Dreisbach and Shrader, 1949 | Based on data from 323. to 386. K. See also Dreisbach and Martin, 1949, 2.; AC |
Antoine Equation Parameters
log10(P) = A − (B / (T + C))
P = vapor pressure (bar)
T = temperature (K)
View plot Requires a JavaScript / HTML 5 canvas capable browser.
Temperature (K) | A | B | C | Reference | Comment |
---|---|---|---|---|---|
323.12 to 386.82 | 4.06974 | 1310.297 | -64.41 | Dreisbach and Shrader, 1949 | Coefficents calculated by NIST from author's data. |
Enthalpy of fusion
ΔfusH (kJ/mol) | Temperature (K) | Reference | Comment |
---|---|---|---|
10.880 | 237.9 | Golovanova and Kolesov, 1984, 2 | DH |
11.38 | 237.1 | Domalski and Hearing, 1996 | AC |
11.380 | 237.1 | Crowe and Smyth, 1950 | DH |
Entropy of fusion
ΔfusS (J/mol*K) | Temperature (K) | Reference | Comment |
---|---|---|---|
45.7 | 237.9 | Golovanova and Kolesov, 1984, 2 | DH |
48.0 | 237.1 | Crowe and Smyth, 1950 | DH |

Reaction thermochemistry data

Data compiled by: Hussein Y. Afeefy, Joel F. Liebman, and Stephen E. Stein
Individual Reactions
By formula: C2H3Cl3 = C2H2Cl2 + HCl
Quantity | Value | Units | Method | Reference | Comment |
---|---|---|---|---|---|
ΔrH° | 51.5 | kJ/mol | Eqk | Levanova, Bushneva, et al., 1979 | gas phase |
ΔrH° | 65.3 | kJ/mol | Eqk | Levanova, Bushneva, et al., 1979 | liquid phase |
By formula: C2H4Cl2 + Cl2 = HCl + C2H3Cl3
Quantity | Value | Units | Method | Reference | Comment |
---|---|---|---|---|---|
ΔrH° | -116. | kJ/mol | Cm | Kirkbride, 1956 | liquid phase; Heat of chlorination |
By formula: C2H2Cl2 + HCl = C2H3Cl3
Quantity | Value | Units | Method | Reference | Comment |
---|---|---|---|---|---|
ΔrH° | -61.1 | kJ/mol | Cm | Levanova, Treger, et al., 1975 | liquid phase |
By formula: C2H3Cl3 = C2H3Cl3
Quantity | Value | Units | Method | Reference | Comment |
---|---|---|---|---|---|
ΔrH° | 8.4 | kJ/mol | Ciso | Levanova, Treger, et al., 1975 | gas phase |

Henry's Law data

Data compiled by: Rolf Sander
Henry's Law constant (water solution)
kH(T) = k°H exp(d(ln(kH))/d(1/T) ((1/T) - 1/(298.15 K)))
k°H = Henry's law constant for solubility in water at 298.15 K (mol/(kg*bar))
d(ln(kH))/d(1/T) = Temperature dependence constant (K)
k°H (mol/(kg*bar)) | d(ln(kH))/d(1/T) (K) | Method | Reference | Comment |
---|---|---|---|---|
1.1 | 4900. | L | N/A | |
1.3 | 5900. | M | N/A | |
1.3 | 6100. | X | N/A | |
1.2 | 4000. | X | N/A | |
1.2 | 3900. | M | N/A | |
1.2 | 3800. | X | N/A | |
1.0 | Q | N/A | missing citation give several references for the Henry's law constants but don't assign them to specific species. | |
1.0 | 4800. | X | N/A | |
1.2 | 4300. | X | Barr and Newsham, 1987 | |
1.2 | 2700. | X | N/A | |
1.2 | 3700. | X | Leighton and Calo, 1981 | |
0.84 | L | N/A | ||
1.1 | V | N/A | ||
1.1 | V | N/A |

Gas phase ion energetics data

Data compiled by: Sharon G. Lias, Rhoda D. Levin, and Sherif A. Kafafi
Ionization energy determinations
IE (eV) | Method | Reference | Comment |
---|---|---|---|
11.0 | PE | Kimura, Katsumata, et al., 1981 | |
11.48 | PE | Kimura, Katsumata, et al., 1981 | Vertical value |
Appearance energy determinations
Ion | AE (eV) | Other Products | Method | Reference | Comment |
---|---|---|---|---|---|
CHCl2+ | 11.80 | CH2Cl | EI | Lossing, 1972 |

Kovats' RI, non-polar column, isothermal

Column type | Active phase | Temperature (C) | I | Reference | Comment |
---|---|---|---|---|---|
Capillary | HP-1 | 0. | 742.8 | Wang, Liu, et al., 2005 | 30. m/0.25 mm/0.25 μm |
Capillary | HP-1 | 10. | 743.1 | Wang, Liu, et al., 2005 | 30. m/0.25 mm/0.25 μm |
Capillary | HP-1 | 20. | 748.1 | Wang, Liu, et al., 2005 | 30. m/0.25 mm/0.25 μm |
Capillary | HP-1 | 30. | 745.1 | Wang, Liu, et al., 2005 | 30. m/0.25 mm/0.25 μm |
Capillary | HP-1 | 40. | 741.4 | Wang, Liu, et al., 2005 | 30. m/0.25 mm/0.25 μm |
Capillary | HP-1 | 50. | 738.7 | Wang, Liu, et al., 2005 | 30. m/0.25 mm/0.25 μm |
Capillary | HP-1 | 60. | 735. | Wang, Liu, et al., 2005 | 30. m/0.25 mm/0.25 μm |
Capillary | OV-1 | 50. | 744. | Villalobos, 1995 | 30. m/0.32 mm/0.96 μm |
Packed | Squalane | 80. | 729. | Pacáková, Vojtechová, et al., 1988 | N2, Chezasorb AW-HMDS; Column length: 1.2 m |
Packed | Porapack Q | 200. | 713. | Goebel, 1982 | N2 |
Packed | Apiezon L | 100. | 769. | Brown, Chapman, et al., 1968 | N2, DCMS-treated Chromosorb W; Column length: 2.3 m |

Kovats' RI, polar column, isothermal

Column type | Active phase | Temperature (C) | I | Reference | Comment |
---|---|---|---|---|---|
Capillary | Carbowax 20M | 70. | 1226. | Annino and Villalobos, 1999 | 31.3 m/0.53 mm/0.54 μm |
Capillary | Carbowax 20M | 50. | 1282. | Villalobos, 1995 | 30. m/0.32 mm/0.54 μm, He |
Packed | Carbowax 20M | 75. | 1267. | Goebel, 1982 | N2, Kieselgur (60-100 mesh); Column length: 2. m |

Van Den Dool and Kratz RI, non-polar column, temperature ramp

Column type | Active phase | I | Reference | Comment |
---|---|---|---|---|
Capillary | Petrocol DH | 739. | White, Hackett, et al., 1992 | 100. m/0.25 mm/0.5 μm, He, 1. K/min; Tstart: 30. C; Tend: 220. C |
Capillary | SE-54 | 772. | Weber, 1986 | 25. m/0.31 mm/0.17 μm, H2, 2. K/min; Tstart: 35. C |
Packed | SE-30 | 747.5 | Zilka and Matucha, 1978 | Ar, Chromaton N-AW-DMCS, 8. K/min; Column length: 2. m; Tstart: 40. C |

Van Den Dool and Kratz RI, polar column, custom temperature program

Column type | Active phase | I | Reference | Comment |
---|---|---|---|---|
Capillary | Supelcowax-10 | 1269. | Bianchi, Careri, et al., 2007 | 30. m/0.25 mm/0.25 μm, He; Program: 35C(8min) => 4C/min => 60C => 6C/min => 160C => 20C/min => 200C(1min) |

Normal alkane RI, non-polar column, temperature ramp

Column type | Active phase | I | Reference | Comment |
---|---|---|---|---|
Capillary | OV-101 | 748. | Zenkevich, Eliseenkov, et al., 2011 | 25. m/0.20 mm/0.25 μm, Nitrogen, 6. K/min; Tstart: 40. C; Tend: 220. C |
Capillary | BP-1 | 747. | Health Safety Executive, 2000 | 50. m/0.22 mm/0.75 μm, He, 5. K/min; Tstart: 50. C; Tend: 200. C |

Normal alkane RI, non-polar column, custom temperature program

Column type | Active phase | I | Reference | Comment |
---|---|---|---|---|
Capillary | Methyl Silicone | 748. | Zenkevich, 2001 | Program: not specified |
Capillary | Methyl Silicone | 752. | Zenkevich, 2001 | Program: not specified |
Capillary | Methyl Silicone | 748. | Zenkevich, 1998 | Program: not specified |
Capillary | SPB-1 | 752. | Flanagan, Streete, et al., 1997 | 60. m/0.53 mm/5. μm, He; Program: 40C(6min) => 5C/min => 80C => 10C/min => 200C |
Capillary | SPB-1 | 752. | Strete, Ruprah, et al., 1992 | 60. m/0.53 mm/5.0 μm, Helium; Program: 40 0C (6 min) 5 0C/min -> 80 0C 10 0C/min -> 200 0C |
Capillary | SPB-1 | 727. | Strete, Ruprah, et al., 1992 | 60. m/0.53 mm/5.0 μm, Helium; Program: not specified |
Capillary | CP Sil 8 CB | 772. | Weller and Wolf, 1989 | 40. m/0.25 mm/0.25 μm, He; Program: 30 0C (1 min) 15 0C/min -> 45 0C 3 0C/min -> 120 0C |
Capillary | OV-1 | 748. | Ramsey and Flanagan, 1982 | Program: not specified |
Capillary | SE-30 | 739. | Heydanek and McGorrin, 1981 | He; Column length: 50. m; Column diameter: 0.5 mm; Program: -10C (8min) => 12C/min => 26C => 3C/min => 170C (30min) |

Normal alkane RI, polar column, custom temperature program

Column type | Active phase | I | Reference | Comment |
---|---|---|---|---|
Capillary | Superox 0.6; Carbowax 20M | 1236. | Waggott and Davies, 1984 | Hydrogen; Column length: 50. m; Column diameter: 0.32 mm; Program: not specified |
Capillary | Carbowax 400, Carbowax 20M, Carbowax 1540, Carbowax 4000, Superox 06, PEG 20M, etc. | 1236. | Waggott and Davies, 1984 | Hydrogen; Column length: 50. m; Column diameter: 0.32 mm; Program: not specified |
Capillary | Carbowax 400, Carbowax 20M, Carbowax 1540, Carbowax 4000, Superox 06, PEG 20M, etc. | 1267. | Waggott and Davies, 1984 | Hydrogen; Column length: 50. m; Column diameter: 0.32 mm; Program: not specified |
Capillary | Carbowax 20M | 1240. | Ramsey and Flanagan, 1982 | Program: not specified |

References

Manion, 2002
Manion, J.A.,
Evaluated Enthalpies of Formation of the Stable Closed Shell C1 and C2 Chlorinated Hydrocarbons,
J. Phys. Chem. Ref. Data, 2002, 31, 1, 123-172, https://doi.org/10.1063/1.1420703
. [all data]
Papina and Kolesov, 1987
Papina, T.S.; Kolesov, V.P.,
Standard enthalpy of formation of 1,1,2-trichloroethane,
Russ. J. Phys. Chem. (Engl. Transl.), 1987, 61, 1170-1172. [all data]
Crowe and Smyth, 1950
Crowe, R.W.; Smyth, C.P.,
Heat capacities, dielectric constants and molecular rotational freedom in solid trichloroethanes and disubstituted propanes,
J. Am. Chem. Soc., 1950, 72, 4009-4015. [all data]
Golovanova and Kolesov, 1984
Golovanova, Y.G.; Kolesov, V.P.,
Enthalpies of melting, melting temperatures, and cryoscopic constants of some haloorganic compounds,
Vestn. Mosk. Univ., Ser. 2: Khim., 1984, 25, 244. [all data]
Dreisbach, 1955
Dreisbach, R.R.,
Physical Properties of Chemical Compounds, Advances in Chemistry Series No. 15, Am. Chem. Soc.: Washington, D. C., 1955. [all data]
Timmermans and Hennaut-Roland, 1955
Timmermans, J.; Hennaut-Roland, M.,
Work of the International Bureau of Physical-Chemical Standards. IX. The Physical Constants of Twenty Organic Compounds,
J. Chim. Phys. Phys.-Chim. Biol., 1955, 52, 223. [all data]
Dreisbach and Martin, 1949
Dreisbach, R.R.; Martin, R.A.,
Physical Data on Some Organic Compounds,
Ind. Eng. Chem., 1949, 41, 2875-8. [all data]
Crowe and Smyth, 1950, 2
Crowe, R.W.; Smyth, C.P.,
Heat capacities, dielectric constants and molecular rotational freedom in solid trichloroethanes and disubstituted propanes,
J. Am. Chem. Soc., 1950, 72, 4009. [all data]
Majer and Svoboda, 1985
Majer, V.; Svoboda, V.,
Enthalpies of Vaporization of Organic Compounds: A Critical Review and Data Compilation, Blackwell Scientific Publications, Oxford, 1985, 300. [all data]
Stephenson and Malanowski, 1987
Stephenson, Richard M.; Malanowski, Stanislaw,
Handbook of the Thermodynamics of Organic Compounds, 1987, https://doi.org/10.1007/978-94-009-3173-2
. [all data]
Dykyj, 1970
Dykyj, J.,
Petrochemica, 1970, 10, 2, 51. [all data]
Williamson and Harrison, 1957
Williamson, K.D.; Harrison, R.H.,
Heats of vaporization of 1,1,2-trichloroethane, 1-propanol, and 2-propanol; vapor heat capacity of 1,1,2-trichloroethane,
J. Chem. Phys., 1957, 26, 1409-14. [all data]
Dreisbach and Shrader, 1949
Dreisbach, R.R.; Shrader, S.A.,
Vapor Pressure--Temperature Data on Some Organic Compounds,
Ind. Eng. Chem., 1949, 41, 12, 2879-2880, https://doi.org/10.1021/ie50480a054
. [all data]
Dreisbach and Martin, 1949, 2
Dreisbach, R.R.; Martin, R.A.,
Physical Data on Some Organic Compounds,
Ind. Eng. Chem., 1949, 41, 12, 2875-2878, https://doi.org/10.1021/ie50480a053
. [all data]
Golovanova and Kolesov, 1984, 2
Golovanova, Yu.G.; Kolesov, V.P.,
Enthalpies of melting, melting temperatures, and cryoscopic constants of some haloorganic compounds, Vestn. Mosk Univ.,
Ser. 2: Khim., 1984, 25(3), 244-248. [all data]
Domalski and Hearing, 1996
Domalski, Eugene S.; Hearing, Elizabeth D.,
Heat Capacities and Entropies of Organic Compounds in the Condensed Phase. Volume III,
J. Phys. Chem. Ref. Data, 1996, 25, 1, 1, https://doi.org/10.1063/1.555985
. [all data]
Levanova, Bushneva, et al., 1979
Levanova, s.V.; Bushneva, I.I.; Rodova, R.M.; Rozhnov, A.M.; Treger, Yu.A.; Aprelkin, A.S.,
Thermodynamic stability of chloroethanes in dehydrochlorination reactions,
J. Appl. Chem. USSR, 1979, 52, 1439-1442. [all data]
Kirkbride, 1956
Kirkbride, F.W.,
The heats of chlorination of some hydrocarbons and their chloro-derivatives,
J. Appl. Chem., 1956, 6, 11-21. [all data]
Levanova, Treger, et al., 1975
Levanova, S.V.; Treger, Yu.A.; Velichko, S.M.; Rozhnov, A.M.; Khlestkov, A.I.; Pisarev, V.V.,
Liquid-phase hydrochlorination of symmetrical dichloroethylenes,
J. Appl. Chem. USSR, 1975, 48, 1628-1631, In original 1574. [all data]
Barr and Newsham, 1987
Barr, R.S.; Newsham, D.M.T.,
Phase Equilibrtia in Very Dilute Mixtures of Water and Chlorinated Hydrocarbons. Part I - Experimental Results,
Fluid Phase Equilibria, 1987, 35, 189-205. [all data]
Leighton and Calo, 1981
Leighton, D.T.; Calo, J.M.,
Distribution Coefficients of Chlorinated Hydrocarbons in Dilute Air-Water Systems for Groundwater Contamination Applications,
J. Chem. Eng. Data, 1981, 26, 382-385. [all data]
Kimura, Katsumata, et al., 1981
Kimura, K.; Katsumata, S.; Achiba, Y.; Yamazaki, T.; Iwata, S.,
Ionization energies, Ab initio assignments, and valence electronic structure for 200 molecules
in Handbook of HeI Photoelectron Spectra of Fundamental Organic Compounds, Japan Scientific Soc. Press, Tokyo, 1981. [all data]
Lossing, 1972
Lossing, F.P.,
Free radicals by mass spectrometry. XLIV. Ionization potentials bond dissociation energies for chloro-and fluoromethyl radicals,
Bull. Soc. Chim. Belg., 1972, 81, 125. [all data]
Wang, Liu, et al., 2005
Wang, Y.; Liu, J.; Li, N.; Shi, G.; Jiang, G.; Ma, W.,
Preliminary study of the retention behavior for different compounds using cryogenic chromatography at different initial temperatures,
Microchem. J., 2005, 81, 2, 184-190, https://doi.org/10.1016/j.microc.2005.02.003
. [all data]
Villalobos, 1995
Villalobos, R.,
A window diagram for key component analysis in on-line gas chromatography,
J. Hi. Res. Chromatogr., 1995, 18, 6, 343-347, https://doi.org/10.1002/jhrc.1240180604
. [all data]
Pacáková, Vojtechová, et al., 1988
Pacáková, V.; Vojtechová, H.; Coufal, P.,
Reaction gas chromatography: study of the photodecomposition of halogenated hydrocarbons,
Chromatographia, 1988, 25, 7, 621-626, https://doi.org/10.1007/BF02327659
. [all data]
Goebel, 1982
Goebel, K.-J.,
Gaschromatographische Identifizierung Niedrig Siedender Substanzen Mittels Retentionsindices und Rechnerhilfe,
J. Chromatogr., 1982, 235, 1, 119-127, https://doi.org/10.1016/S0021-9673(00)95793-5
. [all data]
Brown, Chapman, et al., 1968
Brown, I.; Chapman, I.L.; Nicholson, G.J.,
Gas chromatography of polar solutes in electron acceptor stationary phases,
Aust. J. Chem., 1968, 21, 5, 1125-1141, https://doi.org/10.1071/CH9681125
. [all data]
Annino and Villalobos, 1999
Annino, R.; Villalobos, R.,
A strategy for the simplification and solution of complex chromatographic analysis problems utilizing two-dimensional mapping of retention indexes followed by computer modeling of heart cuts from serially coupled columns containing different stationary phases,
J. Hi. Res. Chromatogr., 1999, 22, 10, 589-593. [all data]
White, Hackett, et al., 1992
White, C.M.; Hackett, J.; Anderson, R.R.; Kail, S.; Spock, P.S.,
Linear temperature programmed retention indices of gasoline range hydrocarbons and chlorinated hydrocarbons on cross-linked polydimethylsiloxane,
J. Hi. Res. Chromatogr., 1992, 15, 2, 105-120, https://doi.org/10.1002/jhrc.1240150211
. [all data]
Weber, 1986
Weber, L.,
Utilization of the Sadtler standard RI system in micropollution analyses,
J. Hi. Res. Chromatogr. Chromatogr. Comm., 1986, 9, 8, 446-451, https://doi.org/10.1002/jhrc.1240090806
. [all data]
Zilka and Matucha, 1978
Zilka, L.; Matucha, M.,
Gas chromatographic analysis of chlorinated ethanes,
J. Chromatogr., 1978, 148, 1, 229-235, https://doi.org/10.1016/S0021-9673(00)99342-7
. [all data]
Bianchi, Careri, et al., 2007
Bianchi, F.; Careri, M.; Mangia, A.; Musci, M.,
Retention indices in the analysis of food aroma volatile compounds in temperature-programmed gas chromatography: Database creation and evaluation of precision and robustness,
J. Sep. Sci., 2007, 39, 4, 563-572, https://doi.org/10.1002/jssc.200600393
. [all data]
Zenkevich, Eliseenkov, et al., 2011
Zenkevich, I.G.; Eliseenkov, E.V.; Kasatochkin, A.N.; Ukolov, A.I.,
Identification of the products of nonregioselective organic reactions by chromatography - mass spectrometry: chloro derivatives of dialkyl ethers,
Rus. J. Anal. Chem., 2011, 66, 14, 1445-1454, https://doi.org/10.1134/S1061934811140218
. [all data]
Health Safety Executive, 2000
Health Safety Executive,
MDHS 96 Volatile organic compounds in air - Laboratory method using pumed solid sorbent tubes, solvent desorption and gas chromatography
in Methods for the Determination of Hazardous Substances (MDHS) guidance, Crown, Colegate, Norwich, 2000, 1-24, retrieved from http://www.hse.gov.uk/pubns/mdhs/pdfs/mdhs96.pdf. [all data]
Zenkevich, 2001
Zenkevich, I.G.,
Comparative Characterization of Conditions for Unambuguous Chromatographic Identification of Organic Compounds,
Zh. Anal. Khim., 2001, 56, 9, 915-924. [all data]
Zenkevich, 1998
Zenkevich, I.G.,
Reciprocally Unambiguous Conformity Between GC Retention Indices and Boiling Points within Two- and Multidimensional Taxonomic Groups of Organic Compounds,
J. Hi. Res. Chromatogr., 1998, 21, 10, 565-568, https://doi.org/10.1002/(SICI)1521-4168(19981001)21:10<565::AID-JHRC565>3.0.CO;2-6
. [all data]
Flanagan, Streete, et al., 1997
Flanagan, R.J.; Streete, P.J.; Ramsey, J.D.,
Volatile Substance Abuse, UNODC Technical Series, No 5, United Nations, Office on Drugs and Crime, Vienna International Centre, PO Box 500, A-1400 Vienna, Austria, 1997, 56, retrieved from http://www.odccp.org/pdf/technicalseries1997-01-011.pdf. [all data]
Strete, Ruprah, et al., 1992
Strete, P.J.; Ruprah, M.; Ramsey, J.D.; Flanagan, R.J.,
Detection and identification of volatile substances by headspace capillary gas chromatography to aid the diagnosis of acute poisoning,
Analyst, 1992, 117, 7, 1111-1127, https://doi.org/10.1039/an9921701111
. [all data]
Weller and Wolf, 1989
Weller, J.-P.; Wolf, M.,
Massenspektroskopie und Headspace-GC,
Beitr. Gerichtl. Med., 1989, 47, 525-532. [all data]
Ramsey and Flanagan, 1982
Ramsey, J.D.; Flanagan, R.J.,
Detection and Identification of Volatile Organic Compounds in Blood by Headspace Gas Chromatography as an Aid to the Diagnosis of Solvent Abuse,
J. Chromatogr., 1982, 240, 2, 423-444, https://doi.org/10.1016/S0021-9673(00)99622-5
. [all data]
Heydanek and McGorrin, 1981
Heydanek, M.G.; McGorrin, R.J.,
Gas chromatography-mass spectroscopy investigations on the flavor chemistry of oat groats,
J. Agric. Food Chem., 1981, 29, 5, 950-954, https://doi.org/10.1021/jf00107a016
. [all data]
Waggott and Davies, 1984
Waggott, A.; Davies, I.W.,
Identification of organic pollutants using linear temperature programmed retention indices (LTPRIs) - Part II, 1984, retrieved from http://dwi.defra.gov.uk/research/completed-research/reports/dwi0383.pdf. [all data]