2-Propanol, 1-amino-
- Formula: C3H9NO
- Molecular weight: 75.1097
- IUPAC Standard InChIKey: HXKKHQJGJAFBHI-UHFFFAOYSA-N
- CAS Registry Number: 78-96-6
- Chemical structure:
View 3d structure (requires JavaScript / HTML 5) - Stereoisomers:
- Other names: α-Aminoisopropyl alcohol; Isopropanolamine; Monoisopropanolamine; Threamine; 1-Amino-2-hydroxypropane; 1-Amino-2-propanol; 1-Methyl-2-aminoethanol; 2-Amino-1-methylethanol; 2-Hydroxy-1-propylamine; 2-Hydroxypropanamine; 2-Hydroxypropylamine; 1-Aminoisopropylalcohol; 1-Aminopropanol-(2); 1-aminopropan-2-ol; 2-Propanol, 1-amino-, (.+/-.)-; MIPA; dl-1-Amino-2-propanol; (RS)-1-Amino-2-hydroxypropane; (.+/-.)-1-Amino-2-propanol; NSC 3188

Phase change data

Data compiled as indicated in comments:
BS - Robert L. Brown and Stephen E. Stein
TRC - Thermodynamics Research Center, NIST Boulder Laboratories, Chris Muzny director
AC - William E. Acree, Jr., James S. Chickos
Quantity | Value | Units | Method | Reference | Comment |
---|---|---|---|---|---|
Tboil | 433.2 | K | N/A | Aldrich Chemical Company Inc., 1990 | BS |
Tboil | 433. | K | N/A | American Tokyo Kasei, 1988 | BS |
Quantity | Value | Units | Method | Reference | Comment |
Tfus | 275. | K | N/A | Dreisbach, 1955 | Uncertainty assigned by TRC = 0.02 K; TRC |
Enthalpy of vaporization
ΔvapH (kJ/mol) | Temperature (K) | Method | Reference | Comment |
---|---|---|---|---|
51.6 | 321. | A | Stephenson and Malanowski, 1987 | Based on data from 306. to 431. K.; AC |

Gas phase ion energetics data

Data compiled by: Sharon G. Lias and Joel F. Liebman
Appearance energy determinations
Ion | AE (eV) | Other Products | Method | Reference | Comment |
---|---|---|---|---|---|
C2H5O+ | 9.56 | CH4N | EI | Holmes, Lossing, et al., 1991 |

References

Aldrich Chemical Company Inc., 1990
Aldrich Chemical Company Inc.,
Catalog Handbook of Fine Chemicals, Aldrich Chemical Company, Inc., Milwaukee WI, 1990, 1. [all data]
American Tokyo Kasei, 1988
American Tokyo Kasei,
TCI American Organic Chemical 88/89 Catalog, American Tokyo Kasei, Portland, OR, 1988, 1610. [all data]
Dreisbach, 1955
Dreisbach, R.R.,
Physical Properties of Chemical Compounds, Advances in Chemistry Series No. 15, Am. Chem. Soc.: Washington, D. C., 1955. [all data]
Stephenson and Malanowski, 1987
Stephenson, Richard M.; Malanowski, Stanislaw,
Handbook of the Thermodynamics of Organic Compounds, 1987, https://doi.org/10.1007/978-94-009-3173-2
. [all data]
Holmes, Lossing, et al., 1991
Holmes, J.L.; Lossing, F.P.; Mayer, P.M.,
Heats of formation of oxygen-containing organic free radicals from appearance energy measurements,
J. Am. Chem. Soc., 1991, 113, 9723. [all data]