Methyl vinyl ketone
- Formula: C4H6O
- Molecular weight: 70.0898
- IUPAC Standard InChIKey: FUSUHKVFWTUUBE-UHFFFAOYSA-N
- CAS Registry Number: 78-94-4
- Chemical structure:

Gas phase thermochemistry data

Data compiled as indicated in comments:
ALS - Hussein Y. Afeefy, Joel F. Liebman, and Stephen E. Stein
GT - Glushko Thermocenter, Russian Academy of Sciences, Moscow
Quantity | Value | Units | Method | Reference | Comment |
---|---|---|---|---|---|
ΔfH°gas | -27.4 ± 2.6 | kcal/mol | Eqk | Guthrie, 1978 | ALS |
Quantity | Value | Units | Method | Reference | Comment |
S°gas | 76.563 | cal/mol*K | N/A | Kharitonov Yu.Ya., 1987 | This value was calculated by statistical mechanical method. Statistically calculated thermodynamic functions of [ Anjaneyulu Y., 1988] (S(300 K)=301.65 and Cp(300 K)=79.23 J/mol*K) seem to be erroneous. Values of S(298.15 K)=316.5 and Cp(298.15 K)=92.2 J/mol*K were calculated from data for related aldehydes and ketones by difference method [ Dorofeeva O.V., 1997].; GT |

Reaction thermochemistry data

Data compiled as indicated in comments:
B - John E. Bartmess
ALS - Hussein Y. Afeefy, Joel F. Liebman, and Stephen E. Stein
Individual Reactions
C4H5O- + =
By formula: C4H5O- + H+ = C4H6O
Quantity | Value | Units | Method | Reference | Comment |
---|---|---|---|---|---|
ΔrH° | 363.3 ± 2.1 | kcal/mol | G+TS | Bartmess and Kiplinger, 1986 | gas phase; value altered from reference due to change in acidity scale; B |
Quantity | Value | Units | Method | Reference | Comment |
ΔrG° | 356.5 ± 2.0 | kcal/mol | IMRE | Bartmess and Kiplinger, 1986 | gas phase; value altered from reference due to change in acidity scale; B |
(CAS Reg. No. 71695-01-7 • 4294967295) +
= CAS Reg. No. 71695-01-7
By formula: (CAS Reg. No. 71695-01-7 • 4294967295C4H6O) + C4H6O = CAS Reg. No. 71695-01-7
Quantity | Value | Units | Method | Reference | Comment |
---|---|---|---|---|---|
ΔrH° | 23.5 ± 4.6 | kcal/mol | N/A | Graul and Squires, 1990 | gas phase; B |
By formula: H2 + C4H6O = C4H8O
Quantity | Value | Units | Method | Reference | Comment |
---|---|---|---|---|---|
ΔrH° | -131.6 | kcal/mol | Chyd | Veselova and Sul'man, 1980 | liquid phase; ALS |

Gas phase ion energetics data

Data evaluated as indicated in comments:
HL - Edward P. Hunter and Sharon G. Lias
L - Sharon G. Lias
Data compiled as indicated in comments:
B - John E. Bartmess
LBLHLM - Sharon G. Lias, John E. Bartmess, Joel F. Liebman, John L. Holmes, Rhoda D. Levin, and W. Gary Mallard
LLK - Sharon G. Lias, Rhoda D. Levin, and Sherif A. Kafafi
RDSH - Henry M. Rosenstock, Keith Draxl, Bruce W. Steiner, and John T. Herron
Quantity | Value | Units | Method | Reference | Comment |
---|---|---|---|---|---|
IE (evaluated) | 9.65 ± 0.02 | eV | N/A | N/A | L |
Quantity | Value | Units | Method | Reference | Comment |
Proton affinity (review) | 199.5 | kcal/mol | N/A | Hunter and Lias, 1998 | HL |
Quantity | Value | Units | Method | Reference | Comment |
Gas basicity | 191.9 | kcal/mol | N/A | Hunter and Lias, 1998 | HL |
Ionization energy determinations
IE (eV) | Method | Reference | Comment |
---|---|---|---|
9.66 | PE | Morizur, Mercier, et al., 1982 | LBLHLM |
9.64 | EI | Terlouw, Heerma, et al., 1980 | LLK |
9.66 | PE | Masclet and Mouvier, 1978 | LLK |
10.11 | PE | Kobayashi, 1978 | Vertical value; LLK |
9.61 | PE | Tam, Yee, et al., 1974 | Vertical value; LLK |
9.67 | PE | Hentrich, Gunkel, et al., 1974 | Vertical value; LLK |
Appearance energy determinations
Ion | AE (eV) | Other Products | Method | Reference | Comment |
---|---|---|---|---|---|
C2H3O+ | 12.40 | C2H3 | EI | Majer, Patrick, et al., 1961 | RDSH |
C3H3O+ | 10.44 ± 0.05 | CH3 | EI | Holmes, Terlouw, et al., 1980 | LLK |
C3H3O+ | 10.85 | CH3 | EI | Majer, Patrick, et al., 1961 | RDSH |
De-protonation reactions
C4H5O- + =
By formula: C4H5O- + H+ = C4H6O
Quantity | Value | Units | Method | Reference | Comment |
---|---|---|---|---|---|
ΔrH° | 363.3 ± 2.1 | kcal/mol | G+TS | Bartmess and Kiplinger, 1986 | gas phase; value altered from reference due to change in acidity scale; B |
Quantity | Value | Units | Method | Reference | Comment |
ΔrG° | 356.5 ± 2.0 | kcal/mol | IMRE | Bartmess and Kiplinger, 1986 | gas phase; value altered from reference due to change in acidity scale; B |

Van Den Dool and Kratz RI, polar column, temperature ramp

Data compiled by: NIST Mass Spectrometry Data Center, William E. Wallace, director

Column type CapillaryCapillary
Active phase Supelcowax-10DB-Wax
Column length (m) 60.60.
Carrier gas HeHe
Substrate
Column diameter (mm) 0.250.25
Phase thickness (μm) 0.250.25
Tstart (C) 40.50.
Tend (C) 280.230.
Heat rate (K/min) 4.3.
Initial hold (min) 2.
Final hold (min)
I 945.948.
ReferenceElmore, Nisyrios, et al., 2005Shimoda, Peralta, et al., 1996
Comment MSDC-RI MSDC-RI

Phase change data

Data compiled as indicated in comments:
BS - Robert L. Brown and Stephen E. Stein
TRC - Thermodynamics Research Center, NIST Boulder Laboratories, Chris Muzny director
AC - William E. Acree, Jr., James S. Chickos

Quantity Value Units Method Reference Comment
Tboil354.6KN/AWeast and Grasselli, 1989BS
Tboil354.KN/AMurata, Arai, et al., 1957Uncertainty assigned by TRC = 4. K; TRC

Reduced pressure boiling point

Tboil (K) Pressure (atm) Reference Comment
309.80.191Aldrich Chemical Company Inc., 1990BS

Enthalpy of vaporization

ΔvapH (kcal/mol) Temperature (K) Method Reference Comment
7.86294.AStephenson and Malanowski, 1987Based on data from 279. to 355. K.; AC
8.03315.AStephenson and Malanowski, 1987Based on data from 300. to 355. K.; AC

In addition to the Thermodynamics Research Center (TRC) data available from this site, much more physical and chemical property data is available from the following TRC products:

Normal alkane RI, polar column, temperature ramp

Data compiled by: NIST Mass Spectrometry Data Center, William E. Wallace, director

Column type CapillaryCapillaryCapillaryCapillaryCapillary
Active phase StabilwaxDB-WaxDB-WaxDB-WaxDB-Wax
Column length (m) 30.30.30.60.60.
Carrier gas HeliumHeHeHeHe
Substrate
Column diameter (mm) 0.250.250.250.250.25
Phase thickness (μm) 0.500.250.250.251.
Tstart (C) 35.50.50.40.50.
Tend (C) 225.220.220.200.200.
Heat rate (K/min) 6.4.4.2.3.
Initial hold (min) 5.4.4.2.
Final hold (min) 10.20.20. 40.
I 961.927.932.943.938.
ReferenceWatcharananun, Cadwallader, et al., 2009Osorio, Duque, et al., 2002Osorio, Duque, et al., 2002Umano, Hagi, et al., 2000Horiuchi, Umano, et al., 1998
Comment MSDC-RI MSDC-RI MSDC-RI MSDC-RI MSDC-RI
Column type CapillaryCapillary
Active phase DB-WaxCarbowax 20M
Column length (m) 60.50.
Carrier gas HeHe
Substrate
Column diameter (mm) 0.250.25
Phase thickness (μm)
Tstart (C) 40.60.
Tend (C) 200.180.
Heat rate (K/min) 2.2.
Initial hold (min) 2.4.
Final hold (min)
I 945.932.
ReferenceUmano, Hagi, et al., 1995Kawakami and Kobayashi, 1991
Comment MSDC-RI MSDC-RI

References

Guthrie, 1978
Guthrie, J.P.,
Equilibrium constants for a series of simple aldol condensations, and linear free energy relations with other carbonyl addition reactions,
Can. J. Chem., 1978, 56, 962-973. [all data]
Kharitonov Yu.Ya., 1987
Kharitonov Yu.Ya.,
Thermodynamic properties of methylvinylketone calculated by statistical mechanics. Deposited at ONIITEkhim, Cherkassy, Ukraine, 16.04.87, No. 417-xn 87 (From Ref. Zh. Khim. 1987, 15 B3025DP), 1987. [all data]
Anjaneyulu Y., 1988
Anjaneyulu Y.,
Thermodynamic functions of some acryl derivatives,
J. Indian Chem. Soc., 1988, 65, 400-403. [all data]
Dorofeeva O.V., 1997
Dorofeeva O.V.,
Unpublished results. Thermocenter of Russian Academy of Science, Moscow, 1997. [all data]
Bartmess and Kiplinger, 1986
Bartmess, J.E.; Kiplinger, J.P.,
'Kinetic' vs. thermodynamic acidities of enones in the gas phase,
J. Org. Chem., 1986, 51, 2173. [all data]
Graul and Squires, 1990
Graul, S.T.; Squires, R.R.,
Gas-Phase Acidities Derived from Threshold Energies for Activated Reactions,
J. Am. Chem. Soc., 1990, 112, 7, 2517, https://doi.org/10.1021/ja00163a007
. [all data]
Veselova and Sul'man, 1980
Veselova, M.E.; Sul'man, E.M.,
Effect of the chemical structure of α,β-unsaturated esters and ketones on the selectivity of their hydrogenation,
Svoistva Veshchestv i Stroenie Molekul, Kalinin, 1980, 140-143. [all data]
Hunter and Lias, 1998
Hunter, E.P.; Lias, S.G.,
Evaluated Gas Phase Basicities and Proton Affinities of Molecules: An Update,
J. Phys. Chem. Ref. Data, 1998, 27, 3, 413-656, https://doi.org/10.1063/1.556018
. [all data]
Morizur, Mercier, et al., 1982
Morizur, J.-P.; Mercier, J.; Sarraf, M.,
2-Substituted-2,3-dihydro-4H-pyrans: Competition between 'Retro Diels-Alder' fragmentation and substituent loss,
Org. Mass Spectrom., 1982, 17, 327. [all data]
Terlouw, Heerma, et al., 1980
Terlouw, J.K.; Heerma, W.; Holmes, J.L.; Burgers, P.C.,
Structure and formation of gaseous [C4H6O]+ ions. 1-The enolic ions [CH2=C(OH)-CH=CH2]+ and [CH2=CH-CH=CH(OH)]+ and their relationship with their keto counterparts,
Org. Mass Spectrom., 1980, 15, 582. [all data]
Masclet and Mouvier, 1978
Masclet, P.; Mouvier, G.,
Etude par spectrometrie photoelectronique d'aldehydes et de cetones ethyleniques conjugues,
J. Electron Spectrosc. Relat. Phenom., 1978, 14, 77. [all data]
Kobayashi, 1978
Kobayashi, T.,
A new rule for photoelectron angular distributions of molecules,
Phys. Lett. A, 1978, 69, 31. [all data]
Tam, Yee, et al., 1974
Tam, W.-C.; Yee, D.; Brion, C.E.,
Photoelectron spectra of some aldehydes and ketones,
J. Electron Spectrosc. Relat. Phenom., 1974, 4, 77. [all data]
Hentrich, Gunkel, et al., 1974
Hentrich, G.; Gunkel, E.; Klessinger, M.,
Photoelektronenspektren organischer verbindungen. 4. Photoelektronenspektren ungesattigter carbonylverbindungen,
J. Mol. Struct., 1974, 21, 231. [all data]
Majer, Patrick, et al., 1961
Majer, J.R.; Patrick, C.R.; Robb, J.C.,
Appearance potentials of the acetyl radical-ion,
J. Chem. Soc. Faraday Trans., 1961, 57, 14. [all data]
Holmes, Terlouw, et al., 1980
Holmes, J.L.; Terlouw, J.K.; Burgers, P.C.,
[C3H3O]+ ions; Reacting and non-reacting configurations,
Org. Mass Spectrom., 1980, 15, 140. [all data]