Silane, triphenyl-
- Formula: C18H16Si
- Molecular weight: 260.4051
- IUPAC Standard InChIKey: AKQNYQDSIDKVJZ-UHFFFAOYSA-N
- CAS Registry Number: 789-25-3
- Chemical structure:
View 3d structure (requires JavaScript / HTML 5) - Other names: Triphenylsilane

Phase change data

Data compiled by: Robert L. Brown and Stephen E. Stein
Reduced pressure boiling point
Tboil (K) | Pressure (bar) | Reference |
---|---|---|
433. to 438. | 0.004 | PCR Inc., 1990 |

Gas phase ion energetics data

Data compiled as indicated in comments:
LLK - Sharon G. Lias, Rhoda D. Levin, and Sherif A. Kafafi
Ionization energy determinations
IE (eV) | Method | Reference | Comment |
---|---|---|---|
8.4 | PE | Distefano, Pignataro, et al., 1976 | LLK |
8.80 ± 0.15 | EI | Gaidis, Briggs, et al., 1971 | LLK |
9.13 ± 0.05 | PE | Distefano, Pignataro, et al., 1976 | Vertical value; LLK |
Appearance energy determinations
Ion | AE (eV) | Other Products | Method | Reference | Comment |
---|---|---|---|---|---|
C18H15Si+ | 9.58 ± 0.08 | H | EI | Gaidis, Briggs, et al., 1971 | LLK |

References

PCR Inc., 1990
PCR Inc.,
Research Chemicals Catalog 1990-1991, PCR Inc., Gainesville, FL, 1990, 1. [all data]
Distefano, Pignataro, et al., 1976
Distefano, G.; Pignataro, S.; Szepes, L.; Borossay, J.,
Photoelectron spectroscopy study of the triphenyl derivatives of the group IV elements,
J. Organomet. Chem., 1976, 104, 173. [all data]
Gaidis, Briggs, et al., 1971
Gaidis, J.M.; Briggs, P.R.; Shannon, T.W.,
Mass spectra of disilanes. Phenyl-silicon interaction and silicon-silicon bond strength,
J. Phys. Chem., 1971, 75, 974. [all data]