1-Propanol, 2-amino-, (.+/-.)-

Gas phase ion energetics data

Data compiled by: Sharon G. Lias, Rhoda D. Levin, and Sherif A. Kafafi

Appearance energy determinations

Ion AE (eV) Other Products MethodReferenceComment
C2H6N+9.00CH2OHEILossing, Lam, et al., 1981

References

Lossing, Lam, et al., 1981
Lossing, F.P.; Lam, Y.-T.; Maccoll, A., Gas phase heats of formation of alkyl immonium ions, Can. J. Chem., 1981, 59, 2228. [all data]