1-Propanol, 2-chloro-
- Formula: C3H7ClO
- Molecular weight: 94.540
- IUPAC Standard InChIKey: VZIQXGLTRZLBEX-UHFFFAOYSA-N
- CAS Registry Number: 78-89-7
- Chemical structure:
- Other names: β-Chloropropyl alcohol; Propylene chlorohydrin; 1-Hydroxy-2-chloropropane; 2-Chloro-1-propanol; 2-Chloropropanol; 2-Chloropropyl alcohol; UN 2611; 2-chloropropan-1-ol

Phase change data

Data compiled by: William E. Acree, Jr., James S. Chickos
Enthalpy of vaporization
ΔvapH (kJ/mol) | Temperature (K) | Method | Reference | Comment |
---|---|---|---|---|
45.0 | 331. | A | Stephenson and Malanowski, 1987 | Based on data from 316. to 399. K. |

Gas phase ion energetics data

Data compiled by: Sharon G. Lias and Joel F. Liebman
Appearance energy determinations
Ion | AE (eV) | Other Products | Method | Reference | Comment |
---|---|---|---|---|---|
CH3O+ | 11.19 | ClCHCH3 | EI | Holmes and Lossing, 1988 |

References

Stephenson and Malanowski, 1987
Stephenson, Richard M.; Malanowski, Stanislaw,
Handbook of the Thermodynamics of Organic Compounds, 1987, https://doi.org/10.1007/978-94-009-3173-2
. [all data]
Holmes and Lossing, 1988
Holmes, J.L.; Lossing, F.P.,
Heats of formation and bond dissociation energies in halogen-substituted methyl and ethyl radicals,
J. Am. Chem. Soc., 1988, 110, 7343. [all data]