1-Buten-3-yne, 2-methyl-
- Formula: C5H6
- Molecular weight: 66.1011
- IUPAC Standard InChIKey: BOFLDKIFLIFLJA-UHFFFAOYSA-N
- CAS Registry Number: 78-80-8
- Chemical structure:
View 3d structure (requires JavaScript / HTML 5) - Other names: Isopropenylacetylene; CH2=C(CH3)C≡CH; 2-Methyl-1-buten-3-yne; 2-Methylbut-1-en-3-yne; Valylene; 3-Methyl-3-buten-1-yne; 2-Methylbutenyne; 2-Methyl-1-butenyne; 1-Butene-3-yne, 2-methyl-; NSC 9296; 3-Methyl-3-butene-1-yne

Gas phase thermochemistry data

Data compiled by: Hussein Y. Afeefy, Joel F. Liebman, and Stephen E. Stein
Quantity | Value | Units | Method | Reference | Comment |
---|---|---|---|---|---|
ΔfH°gas | 259. | kJ/mol | Ccb | Lebedeva, Ryadnenko, et al., 1977 |

Condensed phase thermochemistry data

Data compiled by: Hussein Y. Afeefy, Joel F. Liebman, and Stephen E. Stein
Quantity | Value | Units | Method | Reference | Comment |
---|---|---|---|---|---|
ΔfH°liquid | 231. ± 0.8 | kJ/mol | Ccb | Lebedeva, Ryadnenko, et al., 1977 | |
Quantity | Value | Units | Method | Reference | Comment |
ΔcH°liquid | -3056. ± 0.8 | kJ/mol | Ccb | Lebedeva, Ryadnenko, et al., 1977 | Corresponding ΔfHºliquid = 231. kJ/mol (simple calculation by NIST; no Washburn corrections) |

Phase change data

Data compiled as indicated in comments:
BS - Robert L. Brown and Stephen E. Stein
TRC - Thermodynamics Research Center, NIST Boulder Laboratories, Chris Muzny director
ALS - Hussein Y. Afeefy, Joel F. Liebman, and Stephen E. Stein
Quantity | Value | Units | Method | Reference | Comment |
---|---|---|---|---|---|
Tboil | 305. to 305.6 | K | N/A | Farchan Laboratories, 1990 | BS |
Tboil | 305.2 | K | N/A | Weast and Grasselli, 1989 | BS |
Tboil | 305.4 | K | N/A | Petrov, Kolesova, et al., 1957 | Uncertainty assigned by TRC = 1.5 K; TRC |
Tboil | 307. | K | N/A | Carothers and Coffman, 1932 | Uncertainty assigned by TRC = 5. K; TRC |
Quantity | Value | Units | Method | Reference | Comment |
ΔvapH° | 27. ± 1. | kJ/mol | C | Lebedeva, Ryadnenko, et al., 1977 | ALS |

Gas phase ion energetics data

Data evaluated as indicated in comments:
L - Sharon G. Lias
Data compiled as indicated in comments:
LLK - Sharon G. Lias, Rhoda D. Levin, and Sherif A. Kafafi
RDSH - Henry M. Rosenstock, Keith Draxl, Bruce W. Steiner, and John T. Herron
Quantity | Value | Units | Method | Reference | Comment |
---|---|---|---|---|---|
IE (evaluated) | 9.25 ± 0.02 | eV | N/A | N/A | L |
Ionization energy determinations
IE (eV) | Method | Reference | Comment |
---|---|---|---|
9.23 ± 0.01 | PE | Carlier, Mouvier, et al., 1979 | LLK |
9.27 ± 0.02 | PE | Bieri, Burger, et al., 1977 | LLK |
10.1 | EI | Polyakova, Zimina, et al., 1959 | RDSH |
9.30 ± 0.03 | PE | Van Hoorn, 1975 | Vertical value; LLK |
Appearance energy determinations
Ion | AE (eV) | Other Products | Method | Reference | Comment |
---|---|---|---|---|---|
C5H5+ | 11.6 | H | EI | Harrison, Haynes, et al., 1965 | RDSH |

Kovats' RI, non-polar column, isothermal

Column type | Active phase | Temperature (C) | I | Reference | Comment |
---|---|---|---|---|---|
Packed | Squalane | 27. | 456. | Hively and Hinton, 1968 | He, Chromosorb P; Column length: 15. m; Column diameter: 0.25 mm |
Packed | Squalane | 49. | 457. | Hively and Hinton, 1968 | He, Chromosorb P; Column length: 15. m; Column diameter: 0.25 mm |
Packed | Squalane | 67. | 457. | Hively and Hinton, 1968 | He, Chromosorb P; Column length: 15. m; Column diameter: 0.25 mm |
Packed | Squalane | 86. | 456. | Hively and Hinton, 1968 | He, Chromosorb P; Column length: 15. m; Column diameter: 0.25 mm |

References

Lebedeva, Ryadnenko, et al., 1977
Lebedeva, N.D.; Ryadnenko, V.L.; Kiseleva, N.N.; Nazarova, L.F.,
Enthalpy of formation of isopropenylacetylene and diisopropenyldiacetylene,
Vses. Konf. Kalorim. Rasshir. Tezisy Dokl. 7th, 1977, 1, 91-95. [all data]
Farchan Laboratories, 1990
Farchan Laboratories,
Research Chemicals Catalog, Farchan Laboratories, Gainesville, FL, 1990, 91. [all data]
Weast and Grasselli, 1989
CRC Handbook of Data on Organic Compounds, 2nd Editon, Weast,R.C and Grasselli, J.G., ed(s)., CRC Press, Inc., Boca Raton, FL, 1989, 1. [all data]
Petrov, Kolesova, et al., 1957
Petrov, A.A.; Kolesova, V.A.; Porfir'eva, Y.I.,
Conjugated Systems. LXXVIII Raman Spectra and Reactivity of Vinylacetylenic Hydrocarbons,
Zh. Obshch. Khim., 1957, 27, 2081-7. [all data]
Carothers and Coffman, 1932
Carothers, W.H.; Coffman, D.D.,
Homologs of Chloroprene and Their Polymers (Second Paper on New Synthetic Rubber),
J. Am. Chem. Soc., 1932, 54, 4071-6. [all data]
Carlier, Mouvier, et al., 1979
Carlier, P.; Mouvier, G.; Mesnard, D.; Miginiac, L.,
Etude par spectrometrie de photoelectrons de la structure electronique des phenyl-alcynes conjugues,
J. Electron Spectrosc. Relat. Phenom., 1979, 16, 147. [all data]
Bieri, Burger, et al., 1977
Bieri, G.; Burger, F.; Heilbronner, E.; Maier, J.P.,
Valence ionization enrgies of hydrocarbons,
Helv. Chim. Acta, 1977, 60, 2213. [all data]
Polyakova, Zimina, et al., 1959
Polyakova, A.A.; Zimina, K.I.; Petrov, A.A.; Klmel'nitskii, R.A.,
Mass Spectra and the structure of vinylacetylenes,
Dokl. Phys. Chem., 1959, 127, 597, In original 386. [all data]
Van Hoorn, 1975
Van Hoorn, M.D.,
He(I) ionisation potentials and MO calculations of butenyne and the monomethyl-substituted butenynes,
J. Electron Spectrosc. Relat. Phenom., 1975, 6, 65. [all data]
Harrison, Haynes, et al., 1965
Harrison, A.G.; Haynes, P.; McLean, S.; Meyer, F.,
The mass spectra of methyl-substituted cyclopentadienes,
J. Am. Chem. Soc., 1965, 87, 5099. [all data]
Hively and Hinton, 1968
Hively, R.A.; Hinton, R.E.,
Variation of the retention index with temperature on squalane substrates,
J. Gas Chromatogr., 1968, 6, 4, 203-217, https://doi.org/10.1093/chromsci/6.4.203
. [all data]