Propane, 1,2-dibromo-
- Formula: C3H6Br2
- Molecular weight: 201.888
- IUPAC Standard InChIKey: XFNJYAKDBJUJAJ-UHFFFAOYSA-N
- CAS Registry Number: 78-75-1
- Chemical structure:
View 3d structure (requires JavaScript / HTML 5) - Other names: Propylene dibromide; 1,2-Dibromopropane; CH2BrCHBrCH3; .+/-.-1,2-Dibromopropane

Condensed phase thermochemistry data

Data compiled by: Eugene S. Domalski and Elizabeth D. Hearing
Constant pressure heat capacity of liquid
Cp,liquid (J/mol*K) | Temperature (K) | Reference | Comment |
---|---|---|---|
172.8 | 298. | Kurbatov, 1948 | T = 10 to 133°C, mean Cp three temperatures. |

Phase change data

Data compiled as indicated in comments:
BS - Robert L. Brown and Stephen E. Stein
TRC - Thermodynamics Research Center, NIST Boulder Laboratories, Chris Muzny director
AC - William E. Acree, Jr., James S. Chickos
Quantity | Value | Units | Method | Reference | Comment |
---|---|---|---|---|---|
Tboil | 414. ± 2. | K | AVG | N/A | Average of 17 values; Individual data points |
Quantity | Value | Units | Method | Reference | Comment |
Tfus | 217.7 | K | N/A | Dreisbach, 1955 | Uncertainty assigned by TRC = 0.02 K; TRC |
Tfus | 217.9 | K | N/A | Timmermans, 1921 | Uncertainty assigned by TRC = 0.2 K; TRC |
Quantity | Value | Units | Method | Reference | Comment |
ΔvapH° | 41.69 | kJ/mol | N/A | Majer and Svoboda, 1985 | |
ΔvapH° | 42.2 | kJ/mol | N/A | Basarová and Svoboda, 1991 | Based on data from 310. to 400. K. See also Pisarev, Rozhnov, et al., 1975.; AC |
ΔvapH° | 42.3 ± 0.7 | kJ/mol | EB | Pisarev, Rozhnov, et al., 1975, 2 | AC |
Enthalpy of vaporization
ΔvapH (kJ/mol) | Temperature (K) | Method | Reference | Comment |
---|---|---|---|---|
35.61 | 415. | N/A | Majer and Svoboda, 1985 | |
41.4 | 327. | A | Stephenson and Malanowski, 1987 | Based on data from 312. to 403. K.; AC |
44.6 | 344. | A | Stephenson and Malanowski, 1987 | Based on data from 329. to 456. K. See also Dykyj, 1970.; AC |
42.8 | 281. | N/A | Stull, 1947 | Based on data from 266. to 415. K.; AC |
Antoine Equation Parameters
log10(P) = A − (B / (T + C))
P = vapor pressure (bar)
T = temperature (K)
View plot Requires a JavaScript / HTML 5 canvas capable browser.
Temperature (K) | A | B | C | Reference | Comment |
---|---|---|---|---|---|
266. to 414.8 | 4.43873 | 1666.951 | -38.3 | Stull, 1947 | Coefficents calculated by NIST from author's data. |

Reaction thermochemistry data

Data compiled by: Hussein Y. Afeefy, Joel F. Liebman, and Stephen E. Stein
Individual Reactions
By formula: C3H6 + Br2 = C3H6Br2
Quantity | Value | Units | Method | Reference | Comment |
---|---|---|---|---|---|
ΔrH° | -122.5 ± 0.84 | kJ/mol | Cm | Conn, Kistiakowsky, et al., 1938 | gas phase; Reanalyzed by Cox and Pilcher, 1970, Original value = -123.1 ± 0.84 kJ/mol; At 355 °K |
By formula: C3H6Br2 = C3H6Br2
Quantity | Value | Units | Method | Reference | Comment |
---|---|---|---|---|---|
ΔrH° | 4.7 ± 0.1 | kJ/mol | Eqk | Sharonov and Rozhnov, 1971 | liquid phase; Heat of isomerization |
By formula: C3H6Br2 = HBr + C3H5Br
Quantity | Value | Units | Method | Reference | Comment |
---|---|---|---|---|---|
ΔrH° | 63.6 | kJ/mol | Eqk | Levanova, Rodova, et al., 1983 | liquid phase; Flow reactor |
By formula: C3H6Br2 = HBr + C3H5Br
Quantity | Value | Units | Method | Reference | Comment |
---|---|---|---|---|---|
ΔrH° | 77.0 | kJ/mol | Eqk | Levanova, Rodova, et al., 1983 | liquid phase; Flow reactor |
By formula: 2C3H6BrCl = C3H6Br2 + C3H6Cl2
Quantity | Value | Units | Method | Reference | Comment |
---|---|---|---|---|---|
ΔrH° | 9.2 | kJ/mol | Eqk | Levanova, Rodova, et al., 1983 | liquid phase; Flow reactor |

Henry's Law data

Data compiled by: Rolf Sander
Henry's Law constant (water solution)
kH(T) = k°H exp(d(ln(kH))/d(1/T) ((1/T) - 1/(298.15 K)))
k°H = Henry's law constant for solubility in water at 298.15 K (mol/(kg*bar))
d(ln(kH))/d(1/T) = Temperature dependence constant (K)
k°H (mol/(kg*bar)) | d(ln(kH))/d(1/T) (K) | Method | Reference | Comment |
---|---|---|---|---|
0.67 | Q | N/A | missing citation give several references for the Henry's law constants but don't assign them to specific species. | |
1.1 | V | N/A |

Gas phase ion energetics data

Data compiled by: Sharon G. Lias, Rhoda D. Levin, and Sherif A. Kafafi
Ionization energy determinations
IE (eV) | Method | Reference | Comment |
---|---|---|---|
10.1 | PE | Kimura, Katsumata, et al., 1981 | |
10.38 | PE | Kimura, Katsumata, et al., 1981 | Vertical value |

Kovats' RI, non-polar column, isothermal

Column type | Active phase | Temperature (C) | I | Reference | Comment |
---|---|---|---|---|---|
Capillary | Squalane | 115. | 846. | Lafosse and Thuaud-Chourrout, 1975 | Column length: 100. m; Column diameter: 0.25 mm |

Van Den Dool and Kratz RI, non-polar column, temperature ramp

Column type | Active phase | I | Reference | Comment |
---|---|---|---|---|
Capillary | DB-1 | 823.0 | Sun and Stremple, 2003 | 30. m/0.25 mm/0.25 μm, He, 3. K/min; Tstart: 40. C; Tend: 325. C |
Capillary | SE-54 | 842. | Weber, 1986 | 25. m/0.31 mm/0.17 μm, H2, 2. K/min; Tstart: 35. C |
Capillary | SE-54 | 849. | Weber, 1986 | 25. m/0.31 mm/0.17 μm, H2, 2. K/min; Tstart: 35. C |
Capillary | SE-54 | 861. | Weber, 1986 | 25. m/0.31 mm/0.17 μm, H2, 2. K/min; Tstart: 35. C |

Normal alkane RI, non-polar column, isothermal

Column type | Active phase | Temperature (C) | I | Reference | Comment |
---|---|---|---|---|---|
Capillary | Apiezon L | 130. | 851. | Arruda, Junkes, et al., 2008 |

References

Kurbatov, 1948
Kurbatov, V.Ya.,
Heat capacity of liquids. 2. Heat capacity and the temperature dependence of heat capacity from halogen derivatives of acylic hydrocarbons,
Zh. Obshch. Kim., 1948, 18, 372-389. [all data]
Dreisbach, 1955
Dreisbach, R.R.,
Physical Properties of Chemical Compounds, Advances in Chemistry Series No. 15, Am. Chem. Soc.: Washington, D. C., 1955. [all data]
Timmermans, 1921
Timmermans, J.,
The Freezing Points of Organic Substances IV. New Exp. Determinations,
Bull. Soc. Chim. Belg., 1921, 30, 62. [all data]
Majer and Svoboda, 1985
Majer, V.; Svoboda, V.,
Enthalpies of Vaporization of Organic Compounds: A Critical Review and Data Compilation, Blackwell Scientific Publications, Oxford, 1985, 300. [all data]
Basarová and Svoboda, 1991
Basarová, Pavlína; Svoboda, Václav,
Calculation of heats of vaporization of halogenated hydrocarbons from saturated vapour pressure data,
Fluid Phase Equilibria, 1991, 68, 13-34, https://doi.org/10.1016/0378-3812(91)85008-I
. [all data]
Pisarev, Rozhnov, et al., 1975
Pisarev, V.V.; Rozhnov, A.M.; Varushchenko, R.M.; Sarkisov, A.G.,
Russ. J. Phys. Chem., 1975, 49, 1605. [all data]
Pisarev, Rozhnov, et al., 1975, 2
Pisarev, V.V.; Rozhnov, A.M.; Varushchenko, R.M.; Sarkisov, A.G.,
Russ. J. Phys. Chem., 1975, 49, 1450. [all data]
Stephenson and Malanowski, 1987
Stephenson, Richard M.; Malanowski, Stanislaw,
Handbook of the Thermodynamics of Organic Compounds, 1987, https://doi.org/10.1007/978-94-009-3173-2
. [all data]
Dykyj, 1970
Dykyj, J.,
Petrochemica, 1970, 10, 2, 51. [all data]
Stull, 1947
Stull, Daniel R.,
Vapor Pressure of Pure Substances. Organic and Inorganic Compounds,
Ind. Eng. Chem., 1947, 39, 4, 517-540, https://doi.org/10.1021/ie50448a022
. [all data]
Conn, Kistiakowsky, et al., 1938
Conn, J.B.; Kistiakowsky, G.B.; Smith, E.A.,
Heats of organic reactions. VII. Addition of halogens to olefins,
J. Am. Chem. Soc., 1938, 60, 2764-2771. [all data]
Cox and Pilcher, 1970
Cox, J.D.; Pilcher, G.,
Thermochemistry of Organic and Organometallic Compounds, Academic Press, New York, 1970, 1-636. [all data]
Sharonov and Rozhnov, 1971
Sharonov, K.G.; Rozhnov, A.M.,
Equilibrium of the isomerization of 1,2-dibromopropane into 1,3-dibromopropane,
J. Org. Chem. USSR (Engl. Transl.), 1971, 10, 2101-2103. [all data]
Levanova, Rodova, et al., 1983
Levanova, S.V.; Rodova, R.M.; Tereshkina, T.P.; Zabrodina, T.I.,
Thermocatalytic reactions of bromochloropropanes,
Russ. J. Phys. Chem. (Engl. Transl.), 1983, 57, 1142-1146. [all data]
Kimura, Katsumata, et al., 1981
Kimura, K.; Katsumata, S.; Achiba, Y.; Yamazaki, T.; Iwata, S.,
Ionization energies, Ab initio assignments, and valence electronic structure for 200 molecules
in Handbook of HeI Photoelectron Spectra of Fundamental Organic Compounds, Japan Scientific Soc. Press, Tokyo, 1981. [all data]
Lafosse and Thuaud-Chourrout, 1975
Lafosse, M.; Thuaud-Chourrout, N.,
Etude du comportement de composés halogénés et mèthoxylés en CG dans le cas de quatre phases stationnaires liquides pouvant former des liaisons de type donneur-accepteur d'électrons avec les groupes fonctionnels de ces composés,
Chromatographia, 1975, 8, 4, 195-202, https://doi.org/10.1007/BF02274456
. [all data]
Sun and Stremple, 2003
Sun, G.; Stremple, P.,
Retention index characterization of flavor, fragrance, and many other compounds on DB-1 and DB-XLB, 2003, retrieved from http://www.chem.agilent.com/cag/cabu/pdf/b-0279.pdf. [all data]
Weber, 1986
Weber, L.,
Utilization of the Sadtler standard RI system in micropollution analyses,
J. Hi. Res. Chromatogr. Chromatogr. Comm., 1986, 9, 8, 446-451, https://doi.org/10.1002/jhrc.1240090806
. [all data]
Arruda, Junkes, et al., 2008
Arruda, A.C.S.; Junkes, B. da.S.; Souza, E.S.; Yunes, R.A.; Heizen, V.E.F.,
Semi-Emlirical Topological Index to Predict Properties of Halogenated Aliphatic Compounds,
J. Chemometrics, 2008, 22, 3-4, 186-194, https://doi.org/10.1002/cem.1121
. [all data]