Ethane, 1,1,2-tribromo-
- Formula: C2H3Br3
- Molecular weight: 266.757
- IUPAC Standard InChIKey: QUMDOMSJJIFTCA-UHFFFAOYSA-N
- CAS Registry Number: 78-74-0
- Chemical structure:
View 3d structure (requires JavaScript / HTML 5) - Other names: 1,1,2-Tribromoethane

Phase change data

Data compiled as indicated in comments:
BS - Robert L. Brown and Stephen E. Stein
TRC - Thermodynamics Research Center, NIST Boulder Laboratories, Chris Muzny director
AC - William E. Acree, Jr., James S. Chickos
Quantity | Value | Units | Method | Reference | Comment |
---|---|---|---|---|---|
Tboil | 462.1 | K | N/A | Weast and Grasselli, 1989 | BS |
Quantity | Value | Units | Method | Reference | Comment |
Tfus | 243.9 | K | N/A | Dreisbach, 1955 | Uncertainty assigned by TRC = 0.02 K; TRC |
Tfus | 237.7 | K | N/A | Timmermans, 1922 | Uncertainty assigned by TRC = 0.4 K; TRC |
Enthalpy of vaporization
ΔvapH (kcal/mol) | Temperature (K) | Method | Reference | Comment |
---|---|---|---|---|
12.1 | 383. | A | Stephenson and Malanowski, 1987 | Based on data from 368. to 511. K. See also Dykyj, 1970.; AC |
12.6 | 321. | N/A | Stull, 1947 | Based on data from 305. to 461. K.; AC |
Antoine Equation Parameters
log10(P) = A − (B / (T + C))
P = vapor pressure (atm)
T = temperature (K)
View plot Requires a JavaScript / HTML 5 canvas capable browser.
Temperature (K) | A | B | C | Reference | Comment |
---|---|---|---|---|---|
305.8 to 461.6 | 4.48204 | 1790.533 | -62.442 | Stull, 1947 | Coefficents calculated by NIST from author's data. |
Enthalpy of fusion
ΔfusH (kcal/mol) | Temperature (K) | Reference | Comment |
---|---|---|---|
2.18 | 244. | Acree, 1991 | AC |

References

Weast and Grasselli, 1989
CRC Handbook of Data on Organic Compounds, 2nd Editon, Weast,R.C and Grasselli, J.G., ed(s)., CRC Press, Inc., Boca Raton, FL, 1989, 1. [all data]
Dreisbach, 1955
Dreisbach, R.R.,
Physical Properties of Chemical Compounds, Advances in Chemistry Series No. 15, Am. Chem. Soc.: Washington, D. C., 1955. [all data]
Timmermans, 1922
Timmermans, J.,
Investigation of the Freezing Point of Organic Substances VII,
Bull. Soc. Chim. Belg., 1922, 31, 389. [all data]
Stephenson and Malanowski, 1987
Stephenson, Richard M.; Malanowski, Stanislaw,
Handbook of the Thermodynamics of Organic Compounds, 1987, https://doi.org/10.1007/978-94-009-3173-2
. [all data]
Dykyj, 1970
Dykyj, J.,
Petrochemica, 1970, 10, 2, 51. [all data]
Stull, 1947
Stull, Daniel R.,
Vapor Pressure of Pure Substances. Organic and Inorganic Compounds,
Ind. Eng. Chem., 1947, 39, 4, 517-540, https://doi.org/10.1021/ie50448a022
. [all data]
Acree, 1991
Acree, William E.,
Thermodynamic properties of organic compounds: enthalpy of fusion and melting point temperature compilation,
Thermochimica Acta, 1991, 189, 1, 37-56, https://doi.org/10.1016/0040-6031(91)87098-H
. [all data]