Pent-1-en-4-yn-3-yl radical
- Formula: C5H5
- Molecular weight: 65.0932
- IUPAC Standard InChIKey: MOHCYMPYDWGDHY-UHFFFAOYSA-N
- CAS Registry Number: 78596-31-3
- Chemical structure:
View 3d structure (requires JavaScript / HTML 5) - Permanent link for this species. Use this link for bookmarking this species for future reference.

Gas phase ion energetics data

Data compiled by: Sharon G. Lias, John E. Bartmess, Joel F. Liebman, John L. Holmes, Rhoda D. Levin, and W. Gary Mallard
Ionization energy determinations
IE (eV) | Method | Reference |
---|---|---|
7.88 | EI | Lossing and Holmes, 1984 |

References

Lossing and Holmes, 1984
Lossing, F.P.; Holmes, J.L.,
Stabilization energy and ion size in carbocations in the gas phase,
J. Am. Chem. Soc., 1984, 106, 6917. [all data]