6,7-Dioxabicyclo[3.2.1]octane, 8-bromo-
- Formula: C6H9BrO2
- Molecular weight: 193.038
- IUPAC Standard InChIKey: RYFNHHUYRHZFQF-UHFFFAOYSA-N
- CAS Registry Number: 78535-39-4
- Chemical structure:
View 3d structure (requires JavaScript / HTML 5) - Permanent link for this species. Use this link for bookmarking this species for future reference.

Gas phase ion energetics data

Data compiled by: Sharon G. Lias, John E. Bartmess, Joel F. Liebman, John L. Holmes, Rhoda D. Levin, and W. Gary Mallard
Ionization energy determinations
IE (eV) | Method | Reference | Comment |
---|---|---|---|
8.9 | PE | Gleiter, Dobler, et al., 1984 | |
9.3 | PE | Gleiter, Dobler, et al., 1984 | Vertical value |

References

Gleiter, Dobler, et al., 1984
Gleiter, R.; Dobler, W.; Eckert-Maksic, M.; Bloodworth, A.J.; Eggelte, H.J.; Cremer, D.,
Photoelectron spectra of dioxabicyclo[n.2.1]alkanes,
J. Org. Chem., 1984, 49, 3716. [all data]