Triethyl phosphate
- Formula: C6H15O4P
- Molecular weight: 182.1547
- IUPAC Standard InChIKey: DQWPFSLDHJDLRL-UHFFFAOYSA-N
- CAS Registry Number: 78-40-0
- Chemical structure:
View 3d structure (requires JavaScript / HTML 5) - Other names: TEP; Phosphoric acid, triethyl ester; Ethyl phosphate; (C2H5O)3PO; Ethyl phosphate ((EtO)3PO); Tris(ethyl) phosphate; Triethylfosfat; o-Phosphoric acid triethyl ester; NSC 2677; Triethoxyphosphine oxide; Ethyl phosphate, tri-

Phase change data

Data compiled as indicated in comments:
TRC - Thermodynamics Research Center, NIST Boulder Laboratories, Chris Muzny director
AC - William E. Acree, Jr., James S. Chickos
Quantity | Value | Units | Method | Reference | Comment |
---|---|---|---|---|---|
Tboil | 489. | K | N/A | Haertel, 1985 | Uncertainty assigned by TRC = 2. K; TRC |
Quantity | Value | Units | Method | Reference | Comment |
ΔvapH° | 55.7 | kJ/mol | CGC | Panneerselvam, Antony, et al., 2007 | Based on data from 413. to 453. K.; AC |
Enthalpy of vaporization
ΔvapH (kJ/mol) | Temperature (K) | Method | Reference | Comment |
---|---|---|---|---|
46.3 | 327. | A | Stephenson and Malanowski, 1987 | Based on data from 312. to 484. K. See also Stull, 1947.; AC |
Antoine Equation Parameters
log10(P) = A − (B / (T + C))
P = vapor pressure (bar)
T = temperature (K)
View plot Requires a JavaScript / HTML 5 canvas capable browser.
Temperature (K) | A | B | C | Reference | Comment |
---|---|---|---|---|---|
312.8 to 484. | 4.89237 | 2277.195 | -19.17 | Stull, 1947 | Coefficents calculated by NIST from author's data. |

Gas phase ion energetics data

Data evaluated as indicated in comments:
HL - Edward P. Hunter and Sharon G. Lias
Data compiled as indicated in comments:
LLK - Sharon G. Lias, Rhoda D. Levin, and Sherif A. Kafafi
RDSH - Henry M. Rosenstock, Keith Draxl, Bruce W. Steiner, and John T. Herron
Quantity | Value | Units | Method | Reference | Comment |
---|---|---|---|---|---|
Proton affinity (review) | 909.3 | kJ/mol | N/A | Hunter and Lias, 1998 | HL |
Quantity | Value | Units | Method | Reference | Comment |
Gas basicity | 879.6 | kJ/mol | N/A | Hunter and Lias, 1998 | HL |
Ionization energy determinations
IE (eV) | Method | Reference | Comment |
---|---|---|---|
10.0 | PE | Chattorpadhyay, Findley, et al., 1981 | LLK |
9.79 | PE | Hodges, McDonnell, et al., 1980 | LLK |
12.8 ± 0.2 | EI | Bafus, Gallegos, et al., 1966 | RDSH |
10.06 ± 0.27 | EI | Bafus, Gallegos, et al., 1966 | RDSH |
10.69 | PE | Chattorpadhyay, Findley, et al., 1981 | Vertical value; LLK |
10.54 | PE | Vovna, Lopatin, et al., 1975 | Vertical value; LLK |
10.4 | PE | Betteridge, Thompson, et al., 1972 | Vertical value; LLK |
Appearance energy determinations
Ion | AE (eV) | Other Products | Method | Reference | Comment |
---|---|---|---|---|---|
C2H5O+ | 16.8 ± 0.2 | ? | EI | Bafus, Gallegos, et al., 1966 | RDSH |
C2H6O3P+ | 15.5 ± 0.4 | ? | EI | Bafus, Gallegos, et al., 1966 | RDSH |
C2H6O4P+ | 13.5 ± 0.3 | ? | EI | Bafus, Gallegos, et al., 1966 | RDSH |
C2H7O3P+ | 13.5 ± 0.3 | ? | EI | Bafus, Gallegos, et al., 1966 | RDSH |
C2H8O3P+ | 13.6 ± 0.2 | ? | EI | Bafus, Gallegos, et al., 1966 | RDSH |
C2H8O4P+ | 12.7 ± 0.2 | ? | EI | Bafus, Gallegos, et al., 1966 | RDSH |
C4H11O3P+ | 11.6 ± 0.4 | ? | EI | Bafus, Gallegos, et al., 1966 | RDSH |
C4H12O3P+ | 12.3 ± 0.2 | ? | EI | Bafus, Gallegos, et al., 1966 | RDSH |
C4H12O4P+ | 11.5 ± 0.3 | C2H3 | EI | Bafus, Gallegos, et al., 1966 | RDSH |
C5H12O4P+ | 11.9 ± 0.3 | CH3 | EI | Bafus, Gallegos, et al., 1966 | RDSH |
PH2O3+ | 17.8 ± 0.3 | ? | EI | Bafus, Gallegos, et al., 1966 | RDSH |
PH3O3+ | 14.4 ± 0.2 | ? | EI | Bafus, Gallegos, et al., 1966 | RDSH |
PH4O3+ | 14.5 ± 0.3 | ? | EI | Bafus, Gallegos, et al., 1966 | RDSH |
PH4O4+ | 14.3 ± 0.3 | ? | EI | Bafus, Gallegos, et al., 1966 | RDSH |

Kovats' RI, non-polar column, isothermal

View large format table.

Column type Active phase Temperature (C) I Reference Comment
CapillaryMethyl Silicone120.1081.Huber, Kenndler, et al., 1993H2; Column length: 5. m; Phase thickness: 2.65 μm
CapillaryMethyl Silicone140.1079.Huber, Kenndler, et al., 1993H2; Column length: 5. m; Phase thickness: 2.65 μm
PackedSE-30220.1108.Zulaïca and Guiochon, 1963Column length: 2. m

Kovats' RI, non-polar column, custom temperature program

View large format table.

Column type Active phase I Reference Comment
PackedSE-301109.Ramsey, Lee, et al., 1980He, Chromosorb G HP (80-100 mesh); Column length: 1.5 m; Program: not specified

Kovats' RI, polar column, isothermal

View large format table.

Column type Active phase Temperature (C) I Reference Comment
CapillaryPEG-20M130.1656.Huber, Kenndler, et al., 1993Column length: 10. m; Phase thickness: 1.33 μm
CapillaryPEG-20M150.1659.Huber, Kenndler, et al., 1993Column length: 10. m; Phase thickness: 1.33 μm
CapillaryPEG-20M130.1656.1Huber, Kenndler, et al., 1993Column length: 10. m; Phase thickness: 1.33 μm

Van Den Dool and Kratz RI, non-polar column, temperature ramp

View large format table.

Column type Active phase I Reference Comment
CapillaryOV-11090.Kostiainen, 200015. m/0.32 mm/0.25 μm, He, 50. C @ 2. min, 10. K/min, 280. C @ 10. min
CapillarySE-541137.2Kostiainen, 200025. m/0.32 mm/0.25 μm, He, 40. C @ 1. min, 10. K/min, 280. C @ 10. min
CapillaryDB-11088.Hancock and Peters, 1991He, 50. C @ 2. min, 10. K/min; Column length: 15. m; Column diameter: 0.53 mm
CapillaryDB-51120.5Hancock and Peters, 1991He, 50. C @ 2. min, 10. K/min; Column length: 15. m; Column diameter: 0.53 mm
CapillaryDB-51121.3Hancock and Peters, 1991He, 50. C @ 2. min, 10. K/min; Column length: 15. m; Column diameter: 0.53 mm
CapillaryDB-51121.5Hancock and Peters, 1991He, 50. C @ 2. min, 10. K/min; Column length: 15. m; Column diameter: 0.53 mm
CapillaryDB-11090.7D'Agostino and Provost, 198515. m/0.32 mm/0.25 μm, He, 50. C @ 2. min, 10. K/min, 300. C @ 5. min
CapillaryDB-51137.2D'Agostino and Provost, 198515. m/0.32 mm/0.25 μm, He, 50. C @ 2. min, 10. K/min; Tend: 300. C
PackedSE-301091.Messadi and Vergnaud, 1979N2, Chromosorb Q, 10. K/min; Tstart: 100. C; Tend: 340. C

Van Den Dool and Kratz RI, non-polar column, custom temperature program

View large format table.

Column type Active phase I Reference Comment
CapillaryOV-1011091.Yasuhara, Shiraishi, et al., 199715. m/0.25 mm/0.25 μm, He; Program: 50C(2min) => (20C/min) => 120C => (7C/min) => 310C(10min)
Capillary5 % Phenyl methyl siloxane1127.Yasuhara, Shiraishi, et al., 199725. m/0.31 mm/0.52 μm, He; Program: 50C(2min) => (20C/min) => 120C => (7C/min) => 310C(10min)

Van Den Dool and Kratz RI, polar column, temperature ramp

View large format table.

Column type Active phase I Reference Comment
CapillaryDB-Wax1672.1D'Agostino and Provost, 198515. m/0.32 mm/0.25 μm, He, 50. C @ 2. min, 10. K/min, 250. C @ 5. min

Normal alkane RI, non-polar column, temperature ramp

View large format table.

Column type Active phase I Reference Comment
CapillaryUltra-11087.Okumura, 199125. m/0.32 mm/0.25 μm, He, 3. K/min; Tstart: 80. C; Tend: 260. C
CapillaryDB-11090.5D'Agostino, Hansen, et al., 198515. m/0.32 mm/0.25 μm, He, 50. C @ 2. min, 10. K/min; Tend: 300. C
CapillaryDB-51137.2D'Agostino, Hansen, et al., 198515. m/0.32 mm/0.25 μm, He, 50. C @ 2. min, 10. K/min; Tend: 300. C

Normal alkane RI, non-polar column, custom temperature program

View large format table.

Column type Active phase I Reference Comment
CapillaryMethyl Silicone1096.Zenkevich, 1999Program: not specified
CapillaryOV-1, SE-30, Methyl silicone, SP-2100, OV-101, DB-1, etc.1091.Waggott and Davies, 1984Hydrogen; Column length: 50. m; Column diameter: 0.32 mm; Program: not specified
CapillaryOV-1, SE-30, Methyl silicone, SP-2100, OV-101, DB-1, etc.1109.Waggott and Davies, 1984Hydrogen; Column length: 50. m; Column diameter: 0.32 mm; Program: not specified
OtherMethyl Silicone1109.Ardrey and Moffat, 1981Program: not specified

References

Haertel, 1985
Haertel, G.H.,
Low-volatility polar organic solvents for sulfur dioxide, hydrogen sulfide, and carbonyl sulfide.,
J. Chem. Eng. Data, 1985, 30, 57. [all data]
Panneerselvam, Antony, et al., 2007
Panneerselvam, K.; Antony, M.P.; Srinivasan, T.G.; Rao, P.R. Vasudeva,
Measurement of enthalpies of vaporization of trialkyl phosphates using correlation gas chromatography,
Thermochimica Acta, 2007, 466, 1-2, 49-56, https://doi.org/10.1016/j.tca.2007.10.007
. [all data]
Stephenson and Malanowski, 1987
Stephenson, Richard M.; Malanowski, Stanislaw,
Handbook of the Thermodynamics of Organic Compounds, 1987, https://doi.org/10.1007/978-94-009-3173-2
. [all data]
Stull, 1947
Stull, Daniel R.,
Vapor Pressure of Pure Substances. Organic and Inorganic Compounds,
Ind. Eng. Chem., 1947, 39, 4, 517-540, https://doi.org/10.1021/ie50448a022
. [all data]
Hunter and Lias, 1998
Hunter, E.P.; Lias, S.G.,
Evaluated Gas Phase Basicities and Proton Affinities of Molecules: An Update,
J. Phys. Chem. Ref. Data, 1998, 27, 3, 413-656, https://doi.org/10.1063/1.556018
. [all data]
Chattorpadhyay, Findley, et al., 1981
Chattorpadhyay, S.; Findley, G.L.; McGlynn, S.P.,
Photoelectron spectroscopy of phosphites and phosphates,
J. Electron Spectrosc. Relat. Phenom., 1981, 24, 27. [all data]
Hodges, McDonnell, et al., 1980
Hodges, R.V.; McDonnell, T.J.; Beauchamp, J.L.,
Properties reactions of trimethyl phosphite, trimethyl phosphate, triethyl phosphate, and trimethyl phosphorothionate by ion cyclotron resonance spectroscopy,
J. Am. Chem. Soc., 1980, 102, 1327. [all data]
Bafus, Gallegos, et al., 1966
Bafus, D.A.; Gallegos, E.J.; Kiser, R.W.,
An electron impact investigation of some alkyl phosphate esters,
J. Phys. Chem., 1966, 70, 2614. [all data]
Vovna, Lopatin, et al., 1975
Vovna, V.I.; Lopatin, S.N.; Pettsol'd, R.; Vilesov, F.I.,
Photoelectron spectra and electronic structure of some phosphoryl compounds,
Khim. Vys. Energ., 1975, 9, 9. [all data]
Betteridge, Thompson, et al., 1972
Betteridge, D.; Thompson, M.; Baker, A.D.; Kemp, N.R.,
Photoelectron spectra of phosphorus halides, alkyl phosphites and phosphates, organophosphorus pesticides, and related compounds,
Anal. Chem., 1972, 44, 2005. [all data]