N-(2,6-Dimethylphenyl)aziridine
- Formula: C10H13N
- Molecular weight: 147.2169
- IUPAC Standard InChIKey: MPWKDJKOBYTMQV-UHFFFAOYSA-N
- CAS Registry Number: 78376-90-6
- Chemical structure:
View 3d structure (requires JavaScript / HTML 5) - Permanent link for this species. Use this link for bookmarking this species for future reference.

Gas phase ion energetics data

Data compiled as indicated in comments:
LBLHLM - Sharon G. Lias, John E. Bartmess, Joel F. Liebman, John L. Holmes, Rhoda D. Levin, and W. Gary Mallard
Ionization energy determinations
IE (eV) | Method | Reference | Comment |
---|---|---|---|
7.88 ± 0.06 | PE | Rozeboom, Houk, et al., 1982 | Vertical value; LBLHLM |
7.9 | PE | Crimaldi, Lichter, et al., 1982 | Vertical value; LBLHLM |

References

Rozeboom, Houk, et al., 1982
Rozeboom, M.D.; Houk, K.N.; Searles, S.; Seyedrezai, S.E.,
Photoelectron spectroscopy of N-aryl cyclic amines. Variable conformations and relationships to gas- and solution-phase basicities,
J. Am. Chem. Soc., 1982, 104, 3448. [all data]
Crimaldi, Lichter, et al., 1982
Crimaldi, K.; Lichter, R.L.; Baker, A.D.,
Nitrogen-15 nuclear magnetic resonance and photoelectron spectroscopy of substituted N-ohenylaziridines,
J. Org. Chem., 1982, 47, 3524. [all data]