Pyrazine, 1,4-dihydro-2,3,4,5-tetramethyl-1,4-bis(trimethylsilyl)-

Gas phase ion energetics data

Data compiled by: Sharon G. Lias, Rhoda D. Levin, and Sherif A. Kafafi

Ionization energy determinations

IE (eV) Method Reference Comment
6.48PEKaim, 1981Vertical value

References

Kaim, 1981
Kaim, W., Organometal-stabilized 1,4-dihydropyrazines: Extremely electron-rich J. Heterocycl. Chem., Angew. Chem. Int. Ed. Engl., 1981, 20, 600. [all data]