N,N'-Dimethyl hexahydropyrazine-2,3-dithione
- Formula: C6H10N2S2
- Molecular weight: 174.287
- IUPAC Standard InChIKey: FRMSTABVRWEXOR-UHFFFAOYSA-N
- CAS Registry Number: 78134-03-9
- Chemical structure:
View 3d structure (requires JavaScript / HTML 5) - Permanent link for this species. Use this link for bookmarking this species for future reference.

Gas phase ion energetics data

Data compiled as indicated in comments:
LLK - Sharon G. Lias, Rhoda D. Levin, and Sherif A. Kafafi
Ionization energy determinations
IE (eV) | Method | Reference | Comment |
---|---|---|---|
7.82 | PE | Henriksen, Isaksson, et al., 1981 | Vertical value; LLK |

References

Henriksen, Isaksson, et al., 1981
Henriksen, L.; Isaksson, R.; Liljefors, T.; Sandstrom, J.,
Ultraviolet absorption and photoelectron spectra of some cyclic and open-chain mono- and dithiooxamides,
Acta Chem. Scand., Ser. B, 1981, 35, 489. [all data]