Isobutyl-p-methylphenyl sulfoxide

Gas phase ion energetics data

Data compiled as indicated in comments:
LLK - Sharon G. Lias, Rhoda D. Levin, and Sherif A. Kafafi

Ionization energy determinations

IE (eV) Method Reference Comment
8.50PEMohraz, Jian-qi, et al., 1981Vertical value; LLK

References

Mohraz, Jian-qi, et al., 1981
Mohraz, M.; Jian-qi, W.; Heilbronner, E.; Solladie-Cavallo, A.; Matloubi-Moghadam, F., 11. Some comments on the conformations of methyl phenyl sulfides, sulfoxides and sulfones, Helv. Chim. Acta, 1981, 64, 97. [all data]