sulphuryl dichloride
- Formula: Cl2O2S
- Molecular weight: 134.970
- IUPAC Standard InChIKey: YBBRCQOCSYXUOC-UHFFFAOYSA-N
- CAS Registry Number: 7791-25-5
- Chemical structure:
View 3d structure (requires JavaScript / HTML 5) - Other names: Sulfuryl chloride

Gas phase thermochemistry data

Quantity | Value | Units | Method | Reference | Comment |
---|---|---|---|---|---|
ΔfH°gas | -354.80 | kJ/mol | Review | Chase, 1998 | Data last reviewed in June, 1971 |
Quantity | Value | Units | Method | Reference | Comment |
S°gas,1 bar | 311.09 | J/mol*K | Review | Chase, 1998 | Data last reviewed in June, 1971 |
Gas Phase Heat Capacity (Shomate Equation)
Cp° = A + B*t + C*t2 + D*t3 +
E/t2
H° − H°298.15= A*t + B*t2/2 +
C*t3/3 + D*t4/4 − E/t + F − H
S° = A*ln(t) + B*t + C*t2/2 + D*t3/3 −
E/(2*t2) + G
Cp = heat capacity (J/mol*K)
H° = standard enthalpy (kJ/mol)
S° = standard entropy (J/mol*K)
t = temperature (K) / 1000.
View plot Requires a JavaScript / HTML 5 canvas capable browser.
Temperature (K) | 298. to 1100. | 1100. to 6000. |
---|---|---|
A | 59.73371 | 107.0539 |
B | 102.7323 | 0.575016 |
C | -85.97534 | -0.116006 |
D | 26.16540 | 0.008015 |
E | -0.562731 | -5.475057 |
F | -378.3600 | -401.5908 |
G | 353.1752 | 418.6678 |
H | -354.8032 | -354.8032 |
Reference | Chase, 1998 | Chase, 1998 |
Comment | Data last reviewed in June, 1971 | Data last reviewed in June, 1971 |

Phase change data

Data compiled as indicated in comments:
TRC - Thermodynamics Research Center, NIST Boulder Laboratories, Chris Muzny director
AC - William E. Acree, Jr., James S. Chickos
Quantity | Value | Units | Method | Reference | Comment |
---|---|---|---|---|---|
Tboil | 341. | K | N/A | Kharasch and Zavist, 1951 | Uncertainty assigned by TRC = 3. K; TRC |
Enthalpy of vaporization
ΔvapH (kJ/mol) | Temperature (K) | Reference | Comment |
---|---|---|---|
34.5 | 272. | Dykyj, Svoboda, et al., 1999 | Based on data from 357. to 365. K.; AC |

Reaction thermochemistry data

Data compiled as indicated in comments:
M - Michael M. Meot-Ner (Mautner) and Sharon G. Lias
ALS - Hussein Y. Afeefy, Joel F. Liebman, and Stephen E. Stein
Individual Reactions
By formula: CH3+ + Cl2O2S = (CH3+ • Cl2O2S)
Quantity | Value | Units | Method | Reference | Comment |
---|---|---|---|---|---|
ΔrH° | 260. | kJ/mol | PHPMS | McMahon, Heinis, et al., 1988 | gas phase; switching reaction(CH3+)N2, Entropy change calculated or estimated, uses MCA(N2) = 202. kJ/mol; Foster, Williamson, et al., 1974; M |
By formula: C8H20N2O2S + 2C4H12ClN = 4C4H11N + Cl2O2S
Quantity | Value | Units | Method | Reference | Comment |
---|---|---|---|---|---|
ΔrH° | 543.9 ± 7.1 | kJ/mol | Cm | Claydon and Mortimer, 1962 | liquid phase; Reanalyzed by Cox and Pilcher, 1970, Original value = 543.1 ± 7.1 kJ/mol; ALS |

Gas phase ion energetics data

Data compiled as indicated in comments:
LLK - Sharon G. Lias, Rhoda D. Levin, and Sherif A. Kafafi
B - John E. Bartmess
Electron affinity determinations
EA (eV) | Method | Reference | Comment |
---|---|---|---|
>2.42397 | IMRB | Robbiani and Franklin, 1979 | EA: > Cl2-; B |
Ionization energy determinations
IE (eV) | Method | Reference | Comment |
---|---|---|---|
11.4 ± 0.5 | EI | Sullivan and Beauchamp, 1978 | LLK |
12.05 | PE | Chadwick, Frost, et al., 1973 | LLK |
12.41 | PE | Solouki, Bock, et al., 1975 | Vertical value; LLK |
12.41 | PE | Solouki, Bock, et al., 1972 | Vertical value; LLK |
12.42 | PE | Mines, Thomas, et al., 1972 | Vertical value; LLK |
12.4 | PE | Chadwick, Cornford, et al., 1972 | Vertical value; LLK |
Appearance energy determinations
Ion | AE (eV) | Other Products | Method | Reference | Comment |
---|---|---|---|---|---|
O2SCl+ | 11.8 ± 0.5 | Cl | EI | Sullivan and Beauchamp, 1978 | LLK |

Ion clustering data

Data compiled by: Michael M. Meot-Ner (Mautner) and Sharon G. Lias
Clustering reactions
By formula: CH3+ + Cl2O2S = (CH3+ • Cl2O2S)
Quantity | Value | Units | Method | Reference | Comment |
---|---|---|---|---|---|
ΔrH° | 260. | kJ/mol | PHPMS | McMahon, Heinis, et al., 1988 | gas phase; switching reaction(CH3+)N2, Entropy change calculated or estimated, uses MCA(N2) = 202. kJ/mol; Foster, Williamson, et al., 1974 |

Vibrational and/or electronic energy levels

Data compiled by: Takehiko Shimanouchi
Symmetry: C2ν Symmetry Number σ = 2
Sym. | No | Approximate | Selected Freq. | Infrared | Raman | Comments | ||||
---|---|---|---|---|---|---|---|---|---|---|
Species | type of mode | Value | Rating | Value | Phase | Value | Phase | |||
a1 | 1 | SO2 s-str | 1205 | C | 1205 S | gas | 1182 S p | liq. | ||
a1 | 2 | SO2 scis | 577 | D | 577 VS | gas | 560 VS p | liq. | ||
a1 | 3 | SCl2 s-str | 408 | D | 408 VS p | liq. | ||||
a1 | 4 | SCl2 scis | 218 | D | 218 VS p | liq. | ||||
a2 | 5 | SO2 twist | 282 | D | ia | 282 S dp | liq. | |||
b1 | 6 | SO2 a-str | 1434 | C | 1434 S | gas | 1414 M dp | liq. | ||
b1 | 7 | SO2 rock | 388 | D | 388 S dp | liq. | ||||
b2 | 8 | SCl2 a-str | 586 | D | 586 VS | gas | 580 VW dp | liq. | ||
b2 | 9 | SO2 wag | 362 | D | 362 sh dp | liq. | ||||
Source: Shimanouchi, 1972

References

Chase, 1998
Chase, M.W., Jr.,
NIST-JANAF Themochemical Tables, Fourth Edition,
J. Phys. Chem. Ref. Data, Monograph 9, 1998, 1-1951. [all data]
Kharasch and Zavist, 1951
Kharasch, M.S.; Zavist, A.F.,
Reactions of Atoms and Free Radicals in Solution. XXIII. The Peroxide- Induced Addition of Sulfuryl Chloride to 1-Alkenes,
J. Am. Chem. Soc., 1951, 73, 964. [all data]
Dykyj, Svoboda, et al., 1999
Dykyj, J.; Svoboda, J.; Wilhoit, R.C.; Frenkel, M.L.; Hall, K.R.,
Vapor Pressure of Chemicals: Part A. Vapor Pressure and Antoine Constants for Hydrocarbons and Sulfur, Selenium, Tellurium and Hydrogen Containing Organic Compounds, Springer, Berlin, 1999, 373. [all data]
McMahon, Heinis, et al., 1988
McMahon, T.; Heinis, T.; Nicol, G.; Hovey, J.K.; Kebarle, P.,
Methyl Cation Affinities,
J. Am. Chem. Soc., 1988, 110, 23, 7591, https://doi.org/10.1021/ja00231a002
. [all data]
Foster, Williamson, et al., 1974
Foster, M.S.; Williamson, A.D.; Beauchamp, J.L.,
Photoionization mass spectrometry of trans-azomethane,
Int. J. Mass Spectrom. Ion Phys., 1974, 15, 429. [all data]
Claydon and Mortimer, 1962
Claydon, A.P.; Mortimer, C.T.,
Heats of formation and bond energies. Part VIII. Diethylaminotrimethylsilane, NN'-dithiodiethylamine, NN'-thionylbisdiethylamine, and NN'-sulphurylbisdiethylamine,
J. Chem. Soc., 1962, 3212-3216. [all data]
Cox and Pilcher, 1970
Cox, J.D.; Pilcher, G.,
Thermochemistry of Organic and Organometallic Compounds, Academic Press, New York, 1970, 1-636. [all data]
Robbiani and Franklin, 1979
Robbiani, R.; Franklin, J.L.,
Negative ion-molecule reaction in sulfuryl halides,
J. Am. Chem. Soc., 1979, 101, 3709. [all data]
Sullivan and Beauchamp, 1978
Sullivan, S.A.; Beauchamp, J.L.,
Positive and negative ion chemistry of sulfuryl halides,
Int. J. Mass Spectrom. Ion Phys., 1978, 28, 69. [all data]
Chadwick, Frost, et al., 1973
Chadwick, D.; Frost, D.C.; Herring, F.G.; Katrib, A.; McDowell, C.A.; McLean, R.A.N.,
Photoelectron spectra of sulfuryl and thionyl halides,
Can. J. Chem., 1973, 51, 1893. [all data]
Solouki, Bock, et al., 1975
Solouki, B.; Bock, H.; Appel, R.,
Photoelektronenspektren und Molekuleigenschaften, XLV Schwefelsaure-Derivate X2SY2: Alkyl-, Vinyl- und Arylsulfone, Alkylsulfoimide und Sulfurylhalogenide,
Chem. Ber., 1975, 108, 897. [all data]
Solouki, Bock, et al., 1972
Solouki, B.; Bock, H.; Appel, R.,
Sequence of orbitals in sulfones and sulfodiimides,
Angew. Chem. Int. Ed. Engl., 1972, 11, 927. [all data]
Mines, Thomas, et al., 1972
Mines, G.W.; Thomas, R.K.; Thompson, H.,
Photoelectron spectra of compounds containing thionyl and sulphuryl groups,
Proc. R. Soc. London A:, 1972, 329, 275. [all data]
Chadwick, Cornford, et al., 1972
Chadwick, D.; Cornford, A.B.; Frost, D.C.; Herring, F.G.; Katrib, A.; McDowell, C.A.; McLean, R.A.N.,
Photoelectron spectra of some dihalocompounds
in Electron spectroscopy, ed. D.A. Shirley (North-Holland Publixhing Co, Amsterdam), 1972, 453. [all data]
Shimanouchi, 1972
Shimanouchi, T.,
Tables of Molecular Vibrational Frequencies Consolidated Volume II,
J. Phys. Chem. Ref. Data, 1972, 6, 3, 993-1102. [all data]