Dichlorine monoxide
- Formula: Cl2O
- Molecular weight: 86.905
- IUPAC Standard InChIKey: RCJVRSBWZCNNQT-UHFFFAOYSA-N
- CAS Registry Number: 7791-21-1
- Chemical structure:
View 3d structure (requires JavaScript / HTML 5) - Other names: Chlorine oxide (Cl2O); Chlorine monooxide; Dichloromonoxide; Chlorine monoxide; Chlorine monoxide (Cl2O); Dichloroxide; Hypochlorous anhydride; Cl2O; Chlorine oxide; Dichlorine oxide

Gas phase thermochemistry data

Quantity | Value | Units | Method | Reference | Comment |
---|---|---|---|---|---|
ΔfH°gas | 87.86 | kJ/mol | Review | Chase, 1998 | Data last reviewed in December, 1992 |
Quantity | Value | Units | Method | Reference | Comment |
S°gas,1 bar | 267.89 | J/mol*K | Review | Chase, 1998 | Data last reviewed in December, 1992 |
Gas Phase Heat Capacity (Shomate Equation)
Cp° = A + B*t + C*t2 + D*t3 +
E/t2
H° − H°298.15= A*t + B*t2/2 +
C*t3/3 + D*t4/4 − E/t + F − H
S° = A*ln(t) + B*t + C*t2/2 + D*t3/3 −
E/(2*t2) + G
Cp = heat capacity (J/mol*K)
H° = standard enthalpy (kJ/mol)
S° = standard entropy (J/mol*K)
t = temperature (K) / 1000.
View plot Requires a JavaScript / HTML 5 canvas capable browser.
Temperature (K) | 298. to 6000. |
---|---|
A | 56.28944 |
B | 1.617418 |
C | -0.436174 |
D | 0.037109 |
E | -0.819554 |
F | 68.26573 |
G | 330.9406 |
H | 87.86400 |
Reference | Chase, 1998 |
Comment | Data last reviewed in December, 1992 |

Phase change data

Antoine Equation Parameters
log10(P) = A − (B / (T + C))
P = vapor pressure (bar)
T = temperature (K)
View plot Requires a JavaScript / HTML 5 canvas capable browser.
Temperature (K) | A | B | C | Reference | Comment |
---|---|---|---|---|---|
174.7 to 275.4 | 4.821 | 1295. | -6.436 | Stull, 1947 | Coefficents calculated by NIST from author's data. |

Henry's Law data

Data compiled by: Rolf Sander
Henry's Law constant (water solution)
kH(T) = k°H exp(d(ln(kH))/d(1/T) ((1/T) - 1/(298.15 K)))
k°H = Henry's law constant for solubility in water at 298.15 K (mol/(kg*bar))
d(ln(kH))/d(1/T) = Temperature dependence constant (K)
k°H (mol/(kg*bar)) | d(ln(kH))/d(1/T) (K) | Method | Reference |
---|---|---|---|
17. | 1700. | L | N/A |
17. | 1800. | L | N/A |

Gas phase ion energetics data

Data evaluated as indicated in comments:
L - Sharon G. Lias
Data compiled as indicated in comments:
LL - Sharon G. Lias and Joel F. Liebman
LLK - Sharon G. Lias, Rhoda D. Levin, and Sherif A. Kafafi
RDSH - Henry M. Rosenstock, Keith Draxl, Bruce W. Steiner, and John T. Herron
B - John E. Bartmess
Quantity | Value | Units | Method | Reference | Comment |
---|---|---|---|---|---|
IE (evaluated) | 10.91 ± 0.02 | eV | N/A | N/A | L |
Electron affinity determinations
EA (eV) | Method | Reference | Comment |
---|---|---|---|
1.30 ± 0.43 | ECD | Wecker, Christodoulides, et al., 1981 | G3MP2B3 calculations indicate an EA of ca. 2.4 eV; B |
Ionization energy determinations
IE (eV) | Method | Reference | Comment |
---|---|---|---|
10.909 ± 0.016 | PI | Thorn, Stief, et al., 1996 | LL |
10.94 | PE | Cornford, Frost, et al., 1971 | LLK |
11.2 ± 0.1 | EI | Fisher, 1968 | RDSH |
11.02 | PE | Chadwick, Cornford, et al., 1972 | Vertical value; LLK |
Appearance energy determinations
Ion | AE (eV) | Other Products | Method | Reference | Comment |
---|---|---|---|---|---|
ClO+ | 12.296 ± 0.032 | O | PI | Thorn, Stief, et al., 1996 | LL |
ClO+ | 12.5 ± 0.1 | Cl | EI | Fisher, 1968 | RDSH |

References

Chase, 1998
Chase, M.W., Jr.,
NIST-JANAF Themochemical Tables, Fourth Edition,
J. Phys. Chem. Ref. Data, Monograph 9, 1998, 1-1951. [all data]
Stull, 1947
Stull, Daniel R.,
Vapor Pressure of Pure Substances. Organic and Inorganic Compounds,
Ind. Eng. Chem., 1947, 39, 4, 517-540, https://doi.org/10.1021/ie50448a022
. [all data]
Wecker, Christodoulides, et al., 1981
Wecker, D.; Christodoulides, A.A.; Schnidler, R.N.,
Studies by the Electron Cyclotron Resonance (ECR) Technique. XV. Interactions of Thermal-Energy Electrons with ClO2 and Cl2O,
Int. J. Mass Spectrom. Ion Phys., 1981, 38, 2-3, 291, https://doi.org/10.1016/0020-7381(81)80084-8
. [all data]
Thorn, Stief, et al., 1996
Thorn, R.P., Jr.; Stief, L.J.; Kuo, S.-C.; Klemm, R.B.,
Ionization energy of Cl2O and ClO, appearance energy of ClO+(Cl2O), and heat of formation of Cl2O,
J. Phys. Chem., 1996, 100, 14178. [all data]
Cornford, Frost, et al., 1971
Cornford, A.B.; Frost, D.C.; Herring, F.G.; McDowell, C.A.,
Photoelectron spectra of F2O and Cl2O,
J. Chem. Phys., 1971, 55, 2820. [all data]
Fisher, 1968
Fisher, I.P.,
Intermediates in the pyrolysis and mass spectrometry of chlorine monoxide and chlorine heptoxide,
J. Chem. Soc. Faraday Trans., 1968, 64, 1852. [all data]
Chadwick, Cornford, et al., 1972
Chadwick, D.; Cornford, A.B.; Frost, D.C.; Herring, F.G.; Katrib, A.; McDowell, C.A.; McLean, R.A.N.,
Photoelectron spectra of some dihalocompounds
in Electron spectroscopy, ed. D.A. Shirley (North-Holland Publixhing Co, Amsterdam), 1972, 453. [all data]