antimony chloride oxide

Gas phase ion energetics data

Data compiled as indicated in comments:
LBLHLM - Sharon G. Lias, John E. Bartmess, Joel F. Liebman, John L. Holmes, Rhoda D. Levin, and W. Gary Mallard

Ionization energy determinations

IE (eV) Method Reference Comment
10.7EIBinnewies, 1983LBLHLM

References

Binnewies, 1983
Binnewies, M., Bildung und stabilitat von gasformigem AsOCl und SbOCl massenspektrometrische untersuchungen, Z. Anorg. Allg. Chem., 1983, 505, 32. [all data]