Hypochlorous acid
- Formula: ClHO
- Molecular weight: 52.460
- IUPAC Standard InChIKey: QWPPOHNGKGFGJK-UHFFFAOYSA-N
- CAS Registry Number: 7790-92-3
- Chemical structure:
View 3d structure (requires JavaScript / HTML 5) - Permanent link for this species. Use this link for bookmarking this species for future reference.

Gas phase thermochemistry data

Quantity | Value | Units | Method | Reference | Comment |
---|---|---|---|---|---|
ΔfH°gas | -74.48 | kJ/mol | Review | Chase, 1998 | Data last reviewed in March, 1979 |
Quantity | Value | Units | Method | Reference | Comment |
S°gas,1 bar | 236.50 | J/mol*K | Review | Chase, 1998 | Data last reviewed in March, 1979 |
Gas Phase Heat Capacity (Shomate Equation)
Cp° = A + B*t + C*t2 + D*t3 +
E/t2
H° − H°298.15= A*t + B*t2/2 +
C*t3/3 + D*t4/4 − E/t + F − H
S° = A*ln(t) + B*t + C*t2/2 + D*t3/3 −
E/(2*t2) + G
Cp = heat capacity (J/mol*K)
H° = standard enthalpy (kJ/mol)
S° = standard entropy (J/mol*K)
t = temperature (K) / 1000.
View plot Requires a JavaScript / HTML 5 canvas capable browser.
Temperature (K) | 298. to 1400. | 1400. to 6000. |
---|---|---|
A | 30.54353 | 53.98406 |
B | 33.68965 | 1.452049 |
C | -20.94787 | -0.247662 |
D | 5.421962 | 0.035130 |
E | -0.143287 | -8.420845 |
F | -85.38665 | -106.2853 |
G | 263.4945 | 283.2681 |
H | -74.47520 | -74.47520 |
Reference | Chase, 1998 | Chase, 1998 |
Comment | Data last reviewed in March, 1979 | Data last reviewed in March, 1979 |

Gas phase ion energetics data

Data compiled as indicated in comments:
B - John E. Bartmess
LLK - Sharon G. Lias, Rhoda D. Levin, and Sherif A. Kafafi
RDSH - Henry M. Rosenstock, Keith Draxl, Bruce W. Steiner, and John T. Herron
Ionization energy determinations
IE (eV) | Method | Reference | Comment |
---|---|---|---|
11.12 ± 0.01 | PE | Colbourne, Frost, et al., 1978 | LLK |
11.7 ± 0.2 | EI | Fisher, 1967 | RDSH |
De-protonation reactions
ClO- + =
Quantity | Value | Units | Method | Reference | Comment |
---|---|---|---|---|---|
ΔrH° | 1488. ± 4.6 | kJ/mol | D-EA | Distelrath and Boesl, 2000 | gas phase; B |
Quantity | Value | Units | Method | Reference | Comment |
ΔrG° | 1461. ± 5.0 | kJ/mol | H-TS | Distelrath and Boesl, 2000 | gas phase; B |

Reaction thermochemistry data

Data compiled by: John E. Bartmess
Individual Reactions
ClO- + =
Quantity | Value | Units | Method | Reference | Comment |
---|---|---|---|---|---|
ΔrH° | 1488. ± 4.6 | kJ/mol | D-EA | Distelrath and Boesl, 2000 | gas phase |
Quantity | Value | Units | Method | Reference | Comment |
ΔrG° | 1461. ± 5.0 | kJ/mol | H-TS | Distelrath and Boesl, 2000 | gas phase |

Henry's Law data

Data compiled by: Rolf Sander
Henry's Law constant (water solution)
kH(T) = k°H exp(d(ln(kH))/d(1/T) ((1/T) - 1/(298.15 K)))
k°H = Henry's law constant for solubility in water at 298.15 K (mol/(kg*bar))
d(ln(kH))/d(1/T) = Temperature dependence constant (K)
k°H (mol/(kg*bar)) | d(ln(kH))/d(1/T) (K) | Method | Reference | Comment |
---|---|---|---|---|
660. | 5900. | L | N/A | |
930. | M | N/A | ||
480. | M | N/A | This value was extrapolated from data at T = 215. K and T = 263. K. | |
730. | M | N/A | ||
260. | 5100. | T | N/A |

References

Chase, 1998
Chase, M.W., Jr.,
NIST-JANAF Themochemical Tables, Fourth Edition,
J. Phys. Chem. Ref. Data, Monograph 9, 1998, 1-1951. [all data]
Colbourne, Frost, et al., 1978
Colbourne, D.; Frost, D.C.; McDowell, C.A.; Westwood, N.P.C.,
The photoelectron spectra of the isoelectronic molecules hypochlorous acid HOCl chloramine NH2Cl,
J. Chem. Phys., 1978, 68, 3574. [all data]
Fisher, 1967
Fisher, I.P.,
Mass spectrometry study of intermediates in thermal decomposition of perchloric acid and chlorine dioxide,
J. Chem. Soc. Faraday Trans., 1967, 63, 684. [all data]
Distelrath and Boesl, 2000
Distelrath, V.; Boesl, U.,
Mass selective gas phase study of ClO, OClO, ClOO and ClAr by anion-ZEKE-photoelectron spectroscopy,
Faraday Disc. Chem. Soc., 2000, 115, 161-174, https://doi.org/10.1039/a909618c
. [all data]