cadmium fluoride

Gas phase ion energetics data

Data compiled by: Sharon G. Lias, Rhoda D. Levin, and Sherif A. Kafafi

Ionization energy determinations

IE (eV) Method Reference
13.18 ± 0.04PELee, Law, et al., 1980

References

Lee, Law, et al., 1980
Lee, E.P.F.; Law, D.; Potts, A.W., Photoelectron spectra and valence shell electronic structure of zinc and cadmium difluoride, J. Chem. Soc. Faraday Trans. 2, 1980, 76, 1314. [all data]