potassium metaphosphate
- Formula: K2O3P
- Molecular weight: 157.1686
- IUPAC Standard InChIKey: OQZCJRJRGMMSGK-UHFFFAOYSA-M
- CAS Registry Number: 7790-53-6
- Chemical structure:
View 3d structure (requires JavaScript / HTML 5) - Permanent link for this species. Use this link for bookmarking this species for future reference.

Gas phase ion energetics data

Data compiled by: Sharon G. Lias, Rhoda D. Levin, and Sherif A. Kafafi
Ionization energy determinations
IE (eV) | Method | Reference | Comment |
---|---|---|---|
9.44 ± 0.03 | PE | Bowling, Allen, et al., 1979 | Vertical value |

References

Bowling, Allen, et al., 1979
Bowling, R.A.; Allen, J.D., Jr.; Schweitzer, G.K.,
The He(I) photoelectron spectra of gaseous alkali metaphosphates,
J. Electron Spectrosc. Relat. Phenom., 1979, 17, 25. [all data]