tin tetraiodide

Gas phase ion energetics data

Data compiled by: Sharon G. Lias, Rhoda D. Levin, and Sherif A. Kafafi

Ionization energy determinations

IE (eV) Method Reference Comment
9.45PEBurroughs, Evans, et al., 1974Vertical value

References

Burroughs, Evans, et al., 1974
Burroughs, P.; Evans, S.; Hamnett, A.; Orchard, A.F.; Richardson, N.V., He-I photoelectron spectra of some d (0) transition metal compounds, J. Chem. Soc. Faraday Trans. 2, 1974, 70, 1895. [all data]