calcium fluoride
- Formula: CaF2
- Molecular weight: 78.075
- CAS Registry Number: 7789-75-5

Condensed phase thermochemistry data

Quantity | Value | Units | Method | Reference | Comment |
---|---|---|---|---|---|
ΔfH°liquid | -283.478 | kcal/mol | Review | Chase, 1998 | Data last reviewed in December, 1968 |
Quantity | Value | Units | Method | Reference | Comment |
S°liquid,1 bar | 22.13 | cal/mol*K | Review | Chase, 1998 | Data last reviewed in December, 1968 |
Quantity | Value | Units | Method | Reference | Comment |
ΔfH°solid | -293.000 | kcal/mol | Review | Chase, 1998 | Data last reviewed in December, 1968 |
Quantity | Value | Units | Method | Reference | Comment |
S°solid | 16.40 | cal/mol*K | Review | Chase, 1998 | Data last reviewed in December, 1968 |
Liquid Phase Heat Capacity (Shomate Equation)
Cp° = A + B*t + C*t2 + D*t3 +
E/t2
H° − H°298.15= A*t + B*t2/2 +
C*t3/3 + D*t4/4 − E/t + F − H
S° = A*ln(t) + B*t + C*t2/2 + D*t3/3 −
E/(2*t2) + G
Cp = heat capacity (cal/mol*K)
H° = standard enthalpy (kcal/mol)
S° = standard entropy (cal/mol*K)
t = temperature (K) / 1000.
View plot Requires a JavaScript / HTML 5 canvas capable browser.
Temperature (K) | 1691. to 4000. |
---|---|
A | 23.88010 |
B | -1.624841×10-9 |
C | 5.607651×10-10 |
D | -6.423311×10-11 |
E | -5.230020×10-10 |
F | -293.9309 |
G | 44.73169 |
H | -283.4771 |
Reference | Chase, 1998 |
Comment | Data last reviewed in December, 1968 |
Solid Phase Heat Capacity (Shomate Equation)
Cp° = A + B*t + C*t2 + D*t3 +
E/t2
H° − H°298.15= A*t + B*t2/2 +
C*t3/3 + D*t4/4 − E/t + F − H
S° = A*ln(t) + B*t + C*t2/2 + D*t3/3 −
E/(2*t2) + G
Cp = heat capacity (cal/mol*K)
H° = standard enthalpy (kcal/mol)
S° = standard entropy (cal/mol*K)
t = temperature (K) / 1000.
View plot Requires a JavaScript / HTML 5 canvas capable browser.
Temperature (K) | 298. to 1424. | 1424. to 1691. |
---|---|---|
A | 21.48280 | 25.82610 |
B | -11.02300 | 2.484542 |
C | 15.60180 | 0.005489 |
D | -4.269291 | -0.000684 |
E | -0.272332 | -0.006699 |
F | -299.9541 | -307.8850 |
G | 43.50041 | 35.30129 |
H | -293.0000 | -293.0000 |
Reference | Chase, 1998 | Chase, 1998 |
Comment | Data last reviewed in December, 1968 | Data last reviewed in December, 1968 |

Gas phase ion energetics data

Data compiled by: Henry M. Rosenstock, Keith Draxl, Bruce W. Steiner, and John T. Herron
Appearance energy determinations
Ion | AE (eV) | Other Products | Method | Reference | Comment |
---|---|---|---|---|---|
CaF+ | 12.5 ± 0.8 | F | EI | Hildenbrand and Murad, 1965 |

Gas phase thermochemistry data

Quantity Value Units Method Reference Comment
Δfgas-784.50kJ/molReviewChase, 1998Data last reviewed in December, 1968
Quantity Value Units Method Reference Comment
gas,1 bar273.77J/mol*KReviewChase, 1998Data last reviewed in December, 1968

Gas Phase Heat Capacity (Shomate Equation)

Cp° = A + B*t + C*t2 + D*t3 + E/t2
H° − H°298.15= A*t + B*t2/2 + C*t3/3 + D*t4/4 − E/t + F − H
S° = A*ln(t) + B*t + C*t2/2 + D*t3/3 − E/(2*t2) + G
    Cp = heat capacity (J/mol*K)
    H° = standard enthalpy (kJ/mol)
    S° = standard entropy (J/mol*K)
    t = temperature (K) / 1000.

View plot Requires a JavaScript / HTML 5 canvas capable browser.

View table.

Temperature (K) 4000. - 6000.
A 57.35762
B 0.717841
C -0.194217
D 0.016557
E -0.571350
F -803.5498
G 339.7609
H -784.5000
ReferenceChase, 1998
Comment Data last reviewed in December, 1968

References

Chase, 1998
Chase, M.W., Jr.,
NIST-JANAF Themochemical Tables, Fourth Edition,
J. Phys. Chem. Ref. Data, Monograph 9, 1998, 1-1951. [all data]
Hildenbrand and Murad, 1965
Hildenbrand, D.L.; Murad, E.,
Dissociation energy of boron monofluoride from mass-spectrometric studies,
J. Chem. Phys., 1965, 43, 1400. [all data]