titanium tetrabromide
- Formula: Br4Ti
- Molecular weight: 367.483
- CAS Registry Number: 7789-68-6

Condensed phase thermochemistry data

Quantity | Value | Units | Method | Reference | Comment |
---|---|---|---|---|---|
ΔfH°liquid | -605.35 | kJ/mol | Review | Chase, 1998 | Data last reviewed in June, 1968 |
Quantity | Value | Units | Method | Reference | Comment |
S°liquid,1 bar | 284.17 | J/mol*K | Review | Chase, 1998 | Data last reviewed in June, 1968 |
Quantity | Value | Units | Method | Reference | Comment |
ΔfH°solid | -617.98 | kJ/mol | Review | Chase, 1998 | Data last reviewed in June, 1968 |
Quantity | Value | Units | Method | Reference | Comment |
S°solid | 243.69 | J/mol*K | Review | Chase, 1998 | Data last reviewed in June, 1968 |
Liquid Phase Heat Capacity (Shomate Equation)
Cp° = A + B*t + C*t2 + D*t3 +
E/t2
H° − H°298.15= A*t + B*t2/2 +
C*t3/3 + D*t4/4 − E/t + F − H
S° = A*ln(t) + B*t + C*t2/2 + D*t3/3 −
E/(2*t2) + G
Cp = heat capacity (J/mol*K)
H° = standard enthalpy (kJ/mol)
S° = standard entropy (J/mol*K)
t = temperature (K) / 1000.
View plot Requires a JavaScript / HTML 5 canvas capable browser.
Temperature (K) | 311.4 to 1000. |
---|---|
A | 151.8792 |
B | 0.000000 |
C | 0.000000 |
D | 0.000000 |
E | 0.000000 |
F | -650.6287 |
G | 467.9678 |
H | -605.3453 |
Reference | Chase, 1998 |
Comment | Data last reviewed in June, 1968 |
Solid Phase Heat Capacity (Shomate Equation)
Cp° = A + B*t + C*t2 + D*t3 +
E/t2
H° − H°298.15= A*t + B*t2/2 +
C*t3/3 + D*t4/4 − E/t + F − H
S° = A*ln(t) + B*t + C*t2/2 + D*t3/3 −
E/(2*t2) + G
Cp = heat capacity (J/mol*K)
H° = standard enthalpy (kJ/mol)
S° = standard entropy (J/mol*K)
t = temperature (K) / 1000.
View plot Requires a JavaScript / HTML 5 canvas capable browser.
Temperature (K) | 298. to 311.4 |
---|---|
A | 146.5818 |
B | -31.75484 |
C | 27.40558 |
D | -7.897509 |
E | -0.638131 |
F | -662.6159 |
G | 425.8099 |
H | -617.9768 |
Reference | Chase, 1998 |
Comment | Data last reviewed in June, 1968 |

Phase change data

Data compiled by: William E. Acree, Jr., James S. Chickos
Enthalpy of sublimation
ΔsubH (kJ/mol) | Temperature (K) | Reference | Comment |
---|---|---|---|
62.4 | 294. | Seki, 1941 | Based on data from 283. to 306. K. |

Gas phase ion energetics data

Data compiled as indicated in comments:
LLK - Sharon G. Lias, Rhoda D. Levin, and Sherif A. Kafafi
RDSH - Henry M. Rosenstock, Keith Draxl, Bruce W. Steiner, and John T. Herron
Ionization energy determinations
IE (eV) | Method | Reference | Comment |
---|---|---|---|
10.59 | PE | Egdell and Orchard, 1978 | Vertical value; LLK |
10.55 | PE | Burroughs, Evans, et al., 1974 | Vertical value; LLK |
10.56 | PE | Green, Green, et al., 1970 | Vertical value; RDSH |

Gas phase thermochemistry data

Quantity Value Units Method Reference Comment
Δfgas-550.20kJ/molReviewChase, 1998Data last reviewed in June, 1968
Quantity Value Units Method Reference Comment
gas,1 bar398.58J/mol*KReviewChase, 1998Data last reviewed in June, 1968

Gas Phase Heat Capacity (Shomate Equation)

Cp° = A + B*t + C*t2 + D*t3 + E/t2
H° − H°298.15= A*t + B*t2/2 + C*t3/3 + D*t4/4 − E/t + F − H
S° = A*ln(t) + B*t + C*t2/2 + D*t3/3 − E/(2*t2) + G
    Cp = heat capacity (J/mol*K)
    H° = standard enthalpy (kJ/mol)
    S° = standard entropy (J/mol*K)
    t = temperature (K) / 1000.

View plot Requires a JavaScript / HTML 5 canvas capable browser.

View table.

Temperature (K) 1000. - 6000.
A 107.6514
B 0.373155
C -0.101265
D 0.008648
E -0.632864
F -584.4295
G 525.1924
H -550.1960
ReferenceChase, 1998
Comment Data last reviewed in June, 1968

Vibrational and/or electronic energy levels

Data compiled by: Takehiko Shimanouchi

Symmetry:   Td     Symmetry Number σ = 12

 Sym.   No   Approximate   Selected Freq.  Infrared   Raman   Comments
 Species   type of mode   Value   Rating   Value  Phase  Value  Phase

a1 1 Sym str 232  B  ia 231.5 gas
e 2 Deg deform 69  B  ia 68.5 gas
f2 3 Deg str 393  C 383 VS liq. 393 gas
f2 4 Deg deform 88  C 88 gas

Source: Shimanouchi, 1972

References

Chase, 1998
Chase, M.W., Jr.,
NIST-JANAF Themochemical Tables, Fourth Edition,
J. Phys. Chem. Ref. Data, Monograph 9, 1998, 1-1951. [all data]
Seki, 1941
Seki, S.,
J. Chem. Soc. Jpn., 1941, 62, 789. [all data]
Egdell and Orchard, 1978
Egdell, R.G.; Orchard, A.F.,
Photoelectron spectra of the group IVA halides,
J. Chem. Soc. Faraday Trans. 2, 1978, 74, 485. [all data]
Burroughs, Evans, et al., 1974
Burroughs, P.; Evans, S.; Hamnett, A.; Orchard, A.F.; Richardson, N.V.,
He-I photoelectron spectra of some d (0) transition metal compounds,
J. Chem. Soc. Faraday Trans. 2, 1974, 70, 1895. [all data]
Green, Green, et al., 1970
Green, J.C.; Green, M.L.H.; Joachim, P.J.; Orchard, A.F.; Turner, D.W.,
A study of the bonding in the group IV tetrahalides by photoelectron spectroscopy,
Phil. Trans. Roy. Soc. (London), 1970, A268, III. [all data]