Stannic bromide
- Formula: Br4Sn
- Molecular weight: 438.326
- IUPAC Standard InChIKey: LTSUHJWLSNQKIP-UHFFFAOYSA-J
- CAS Registry Number: 7789-67-5
- Chemical structure:

Phase change data

Data compiled as indicated in comments:
AC - William E. Acree, Jr., James S. Chickos
Antoine Equation Parameters
log10(P) = A − (B / (T + C))
P = vapor pressure (bar)
T = temperature (K)
View plot Requires a JavaScript / HTML 5 canvas capable browser.
Temperature (K) | A | B | C | Reference | Comment |
---|---|---|---|---|---|
331.4 to 477.9 | 4.3977 | 1929.929 | -38.062 | Stull, 1947 | Coefficents calculated by NIST from author's data. |
Enthalpy of sublimation
ΔsubH (kJ/mol) | Temperature (K) | Reference | Comment |
---|---|---|---|
62.4 | 278. | Seki, 1941 | Based on data from 257. to 299. K.; AC |

Gas phase ion energetics data

Data compiled by: Henry M. Rosenstock, Keith Draxl, Bruce W. Steiner, and John T. Herron
Ionization energy determinations
IE (eV) | Method | Reference | Comment |
---|---|---|---|
10.6 ± 0.4 | EI | Knowles, Nicholson, et al., 1970 | |
11.0 | PE | Green, Green, et al., 1970 | Vertical value |
Appearance energy determinations
Ion | AE (eV) | Other Products | Method | Reference | Comment |
---|---|---|---|---|---|
SnBr+ | 13.7 ± 1.0 | ? | EI | Knowles, Nicholson, et al., 1970 | |
SnBr2+ | 12.0 ± 1.0 | ? | EI | Knowles, Nicholson, et al., 1970 | |
SnBr3+ | 11.3 ± 0.4 | Br | EI | Knowles, Nicholson, et al., 1970 | |
Sn+ | 18.5 ± 1.0 | ? | EI | Knowles, Nicholson, et al., 1970 |

Vibrational and/or electronic energy levels

Data compiled by: Takehiko Shimanouchi
Symmetry: Td Symmetry Number σ = 12
Sym. | No | Approximate | Selected Freq. | Infrared | Raman | Comments | ||||
---|---|---|---|---|---|---|---|---|---|---|
Species | type of mode | Value | Rating | Value | Phase | Value | Phase | |||
a1 | 1 | Sym str | 220 | C | ia | 220 | liq. | |||
e | 2 | Deg deform | 64 | C | ia | 64 | liq. | |||
f2 | 3 | Deg str | 279 | C | 279 | liq. | ||||
f2 | 4 | Deg deform | 88 | C | 88 | liq. | ||||
Source: Shimanouchi, 1972

References

Stull, 1947
Stull, Daniel R.,
Vapor Pressure of Pure Substances. Organic and Inorganic Compounds,
Ind. Eng. Chem., 1947, 39, 4, 517-540, https://doi.org/10.1021/ie50448a022
. [all data]
Seki, 1941
Seki, S.,
J. Chem. Soc. Jpn., 1941, 62, 789. [all data]
Knowles, Nicholson, et al., 1970
Knowles, D.J.; Nicholson, A.J.C.; Swingler, D.L.,
Electron impact studies. II.Stannous bromide and stannic bromide,
J. Phys. Chem., 1970, 74, 3642. [all data]
Green, Green, et al., 1970
Green, J.C.; Green, M.L.H.; Joachim, P.J.; Orchard, A.F.; Turner, D.W.,
A study of the bonding in the group IV tetrahalides by photoelectron spectroscopy,
Phil. Trans. Roy. Soc. (London), 1970, A268, III. [all data]
Shimanouchi, 1972
Shimanouchi, T.,
Tables of Molecular Vibrational Frequencies Consolidated Volume I, National Bureau of Standards, 1972, 1-160. [all data]