Phosphorus tribromide
- Formula: Br3P
- Molecular weight: 270.686
- IUPAC Standard InChIKey: IPNPIHIZVLFAFP-UHFFFAOYSA-N
- CAS Registry Number: 7789-60-8
- Chemical structure:

Gas phase thermochemistry data

Quantity | Value | Units | Method | Reference | Comment |
---|---|---|---|---|---|
ΔfH°gas | -146.02 | kJ/mol | Review | Chase, 1998 | Data last reviewed in December, 1963 |
Quantity | Value | Units | Method | Reference | Comment |
S°gas,1 bar | 348.22 | J/mol*K | Review | Chase, 1998 | Data last reviewed in December, 1963 |
Gas Phase Heat Capacity (Shomate Equation)
Cp° = A + B*t + C*t2 + D*t3 +
E/t2
H° − H°298.15= A*t + B*t2/2 +
C*t3/3 + D*t4/4 − E/t + F − H
S° = A*ln(t) + B*t + C*t2/2 + D*t3/3 −
E/(2*t2) + G
Cp = heat capacity (J/mol*K)
H° = standard enthalpy (kJ/mol)
S° = standard entropy (J/mol*K)
t = temperature (K) / 1000.
View plot Requires a JavaScript / HTML 5 canvas capable browser.
Temperature (K) | 298. to 6000. |
---|---|
A | 82.68086 |
B | 0.396137 |
C | -0.107517 |
D | 0.009187 |
E | -0.607864 |
F | -172.7285 |
G | 444.7425 |
H | -146.0220 |
Reference | Chase, 1998 |
Comment | Data last reviewed in December, 1963 |

Reaction thermochemistry data

Data compiled by: John E. Bartmess
Individual Reactions
+
= Br4P-
By formula: Br- + Br3P = Br4P-
Quantity | Value | Units | Method | Reference | Comment |
---|---|---|---|---|---|
ΔrH° | 64.9 ± 5.9 | kJ/mol | CIDT | Heil, Check, et al., 2002 | gas phase |

Gas phase ion energetics data

Data compiled as indicated in comments:
LLK - Sharon G. Lias, Rhoda D. Levin, and Sherif A. Kafafi
RDSH - Henry M. Rosenstock, Keith Draxl, Bruce W. Steiner, and John T. Herron
B - John E. Bartmess
Electron affinity determinations
EA (eV) | Method | Reference | Comment |
---|---|---|---|
1.59 ± 0.15 | NBIE | Mathur, Rothe, et al., 1976 | B |
Ionization energy determinations
IE (eV) | Method | Reference | Comment |
---|---|---|---|
10.1 ± 0.1 | EI | Varmuza and Krenmayr, 1971 | LLK |
9.85 | EI | Muller and Fenderl, 1969 | RDSH |
10.0 ± 0.2 | EI | Kiser, Dillard, et al., 1969 | RDSH |
9.99 | PE | Daamen, Boxhoorn, et al., 1978 | Vertical value; LLK |
10.00 | PE | Nicholson and Rademacher, 1974 | Vertical value; LLK |
9.96 | PE | Berkosky, Ellison, et al., 1973 | Vertical value; LLK |
10.00 ± 0.03 | PE | Cox, Evans, et al., 1972 | Vertical value; LLK |
10.0 | PE | Betteridge, Thompson, et al., 1972 | Vertical value; LLK |
Appearance energy determinations
Ion | AE (eV) | Other Products | Method | Reference | Comment |
---|---|---|---|---|---|
Br+ | 17.1 ± 0.5 | ? | EI | Kiser, Dillard, et al., 1969 | RDSH |
PBr+ | 14.2 ± 0.2 | ? | EI | Varmuza and Krenmayr, 1971 | LLK |
PBr+ | 15.6 ± 0.3 | ? | EI | Kiser, Dillard, et al., 1969 | RDSH |
PBr2+ | 11.2 ± 0.1 | Br | EI | Varmuza and Krenmayr, 1971 | LLK |
PBr2+ | 11.4 ± 0.2 | Br | EI | Kiser, Dillard, et al., 1969 | RDSH |
P+ | 16.7 ± 0.7 | Br2+Br | EI | Varmuza and Krenmayr, 1971 | LLK |
P+ | 20.1 ± 0.5 | ? | EI | Kiser, Dillard, et al., 1969 | RDSH |

Ion clustering data

Data compiled by: John E. Bartmess
Clustering reactions
+
= Br4P-
By formula: Br- + Br3P = Br4P-
Quantity | Value | Units | Method | Reference | Comment |
---|---|---|---|---|---|
ΔrH° | 64.9 ± 5.9 | kJ/mol | CIDT | Heil, Check, et al., 2002 | gas phase |

Phase change data

Data compiled as indicated in comments:
TRC - Thermodynamics Research Center, NIST Boulder Laboratories, Chris Muzny director
Quantity | Value | Units | Method | Reference | Comment |
---|---|---|---|---|---|
Tboil | 351.7 | K | N/A | Bridgman, 1913 | Uncertainty assigned by TRC = 3. K; TRC |
Quantity | Value | Units | Method | Reference | Comment |
Tc | 711. | K | N/A | Sladkov and Shimeleva, 1974 | Uncertainty assigned by TRC = 2. K; TRC |
Tc | 711. | K | N/A | Sladkov, 1973 | Uncertainty assigned by TRC = 0.5 K; TRC |
Quantity | Value | Units | Method | Reference | Comment |
Vc | 0.295 | l/mol | N/A | Sladkov and Shimeleva, 1974 | Uncertainty assigned by TRC = 0.005 l/mol; Abstract, no details; TRC |
Vc | 0.300 | l/mol | N/A | Sladkov, 1973 | Uncertainty assigned by TRC = 0.009 l/mol; Abstract of deposited paper; Vis, Vc from liquid volume onl; TRC |
Antoine Equation Parameters
log10(P) = A − (B / (T + C))
P = vapor pressure (bar)
T = temperature (K)
View plot Requires a JavaScript / HTML 5 canvas capable browser.
Temperature (K) | A | B | C | Reference | Comment |
---|---|---|---|---|---|
280.9 to 448.5 | 4.15129 | 1694.636 | -39.741 | Stull, 1947 | Coefficents calculated by NIST from author's data. |

References

Chase, 1998
Chase, M.W., Jr.,
NIST-JANAF Themochemical Tables, Fourth Edition,
J. Phys. Chem. Ref. Data, Monograph 9, 1998, 1-1951. [all data]
Heil, Check, et al., 2002
Heil, T.E.; Check, C.E.; Lobring, K.C.; Sunderlin, L.S.,
The thermochemistry of phosphorus tetrahalide anions,
J. Phys. Chem. A, 2002, 106, 42, 10043-10048, https://doi.org/10.1021/jp021386y
. [all data]
Mathur, Rothe, et al., 1976
Mathur, B.P.; Rothe, E.W.; Tang, S.Y.; Reck, G.,
Negative ions from phosphorus halides due to cesium charge exchange,
J. Chem. Phys., 1976, 64, 565. [all data]
Varmuza and Krenmayr, 1971
Varmuza, K.; Krenmayr, P.,
Massenspektrometrische untersuchungen einfacher und gemischter phosphortrihalogenide,
Monatsh. Chem., 1971, 102, 1037. [all data]
Muller and Fenderl, 1969
Muller, J.; Fenderl, K.,
Massenspektren und Ionisierungspotentiale von C5H5Mn(CO)2PX3-Komplexen,
J. Organometal. Chem., 1969, 19, 123. [all data]
Kiser, Dillard, et al., 1969
Kiser, R.W.; Dillard, J.G.; Dugger, D.L.,
Mass spectrometry of inorganic halides,
Advan. Chem. Ser., 1969, 72, 153. [all data]
Daamen, Boxhoorn, et al., 1978
Daamen, H.; Boxhoorn, G.; Oskam, A.,
U. V. photoelectron (He I and He II) studies of M(CO)5PX3 (M=Cr, Mo, W and X=F, Cl, Br),
Inorg. Chim. Acta, 1978, 28, 263. [all data]
Nicholson and Rademacher, 1974
Nicholson, D.G.; Rademacher, P.,
Photoelectron spectra and electronic structures of antimony(III) halides,
Acta Chem. Scand. Ser. A:, 1974, 28, 1136. [all data]
Berkosky, Ellison, et al., 1973
Berkosky, J.L.; Ellison, F.O.; Lee, T.H.; Rabalais, J.W.,
Model for calculating spin-orbit interactions with applications to photoelectron spectroscopy,
J. Chem. Phys., 1973, 59, 5342. [all data]
Cox, Evans, et al., 1972
Cox, P.A.; Evans, S.; Orchard, A.F.; Richardson, N.V.; Roberts, P.J.,
Simple quantitative molecular orbital methods used in connection with photoelectron spectroscopy,
Faraday Discuss. Chem. Soc., 1972, 54, 26. [all data]
Betteridge, Thompson, et al., 1972
Betteridge, D.; Thompson, M.; Baker, A.D.; Kemp, N.R.,
Photoelectron spectra of phosphorus halides, alkyl phosphites and phosphates, organophosphorus pesticides, and related compounds,
Anal. Chem., 1972, 44, 2005. [all data]