magnesium bromide
- Formula: Br2Mg
- Molecular weight: 184.113
- CAS Registry Number: 7789-48-2

Condensed phase thermochemistry data

Quantity | Value | Units | Method | Reference | Comment |
---|---|---|---|---|---|
ΔfH°liquid | -490.41 | kJ/mol | Review | Chase, 1998 | Data last reviewed in June, 1974 |
Quantity | Value | Units | Method | Reference | Comment |
S°liquid,1 bar | 150.49 | J/mol*K | Review | Chase, 1998 | Data last reviewed in June, 1974 |
Quantity | Value | Units | Method | Reference | Comment |
ΔfH°solid | -524.26 | kJ/mol | Review | Chase, 1998 | Data last reviewed in June, 1974 |
Quantity | Value | Units | Method | Reference | Comment |
S°solid | 117.11 | J/mol*K | Review | Chase, 1998 | Data last reviewed in June, 1974 |
Liquid Phase Heat Capacity (Shomate Equation)
Cp° = A + B*t + C*t2 + D*t3 +
E/t2
H° − H°298.15= A*t + B*t2/2 +
C*t3/3 + D*t4/4 − E/t + F − H
S° = A*ln(t) + B*t + C*t2/2 + D*t3/3 −
E/(2*t2) + G
Cp = heat capacity (J/mol*K)
H° = standard enthalpy (kJ/mol)
S° = standard entropy (J/mol*K)
t = temperature (K) / 1000.
View plot Requires a JavaScript / HTML 5 canvas capable browser.
Temperature (K) | 984. to 2000. |
---|---|
A | 104.6000 |
B | -2.538651×10-7 |
C | 1.516441×10-7 |
D | -3.089926×10-8 |
E | -1.906223×10-8 |
F | -531.8115 |
G | 254.8244 |
H | -490.4066 |
Reference | Chase, 1998 |
Comment | Data last reviewed in June, 1974 |
Solid Phase Heat Capacity (Shomate Equation)
Cp° = A + B*t + C*t2 + D*t3 +
E/t2
H° − H°298.15= A*t + B*t2/2 +
C*t3/3 + D*t4/4 − E/t + F − H
S° = A*ln(t) + B*t + C*t2/2 + D*t3/3 −
E/(2*t2) + G
Cp = heat capacity (J/mol*K)
H° = standard enthalpy (kJ/mol)
S° = standard entropy (J/mol*K)
t = temperature (K) / 1000.
View plot Requires a JavaScript / HTML 5 canvas capable browser.
Temperature (K) | 298. to 984. |
---|---|
A | 85.69418 |
B | -16.67119 |
C | 25.90026 |
D | -5.878270 |
E | -0.859787 |
F | -552.1792 |
G | 219.8470 |
H | -524.2552 |
Reference | Chase, 1998 |
Comment | Data last reviewed in June, 1974 |

Reaction thermochemistry data

Data compiled by: José A. Martinho Simões
Individual Reactions
(g) + CH3BrMg (solution) =
(solution) + Br2Mg (solution)
By formula: HBr (g) + CH3BrMg (solution) = CH4 (solution) + Br2Mg (solution)
Quantity | Value | Units | Method | Reference | Comment |
---|---|---|---|---|---|
ΔrH° | -274.5 ± 2.2 | kJ/mol | RSC | Holm, 1981 | solvent: Diethyl ether; The enthalpy of formation was calculated using the assumptions and the auxiliary data in Holm, 1981, except for the organic compound, whose enthalpy of formation was quoted from Pedley, 1994 |
(g) + C2H3BrMg (solution) =
(solution) + Br2Mg (solution)
By formula: HBr (g) + C2H3BrMg (solution) = C2H4 (solution) + Br2Mg (solution)
Quantity | Value | Units | Method | Reference | Comment |
---|---|---|---|---|---|
ΔrH° | -294.1 ± 2.2 | kJ/mol | RSC | Holm, 1981 | solvent: Tetrahydrofuran |
C4H9BrMg (solution) + (g) =
(solution) + Br2Mg (solution)
By formula: C4H9BrMg (solution) + HBr (g) = C4H10 (solution) + Br2Mg (solution)
Quantity | Value | Units | Method | Reference | Comment |
---|---|---|---|---|---|
ΔrH° | -292.5 ± 2.2 | kJ/mol | RSC | Holm, 1981 | solvent: Diethyl ether |
C4H9BrMg (solution) + (g) =
(solution) + Br2Mg (solution)
By formula: C4H9BrMg (solution) + HBr (g) = C4H10 (solution) + Br2Mg (solution)
Quantity | Value | Units | Method | Reference | Comment |
---|---|---|---|---|---|
ΔrH° | -305.9 ± 2.2 | kJ/mol | RSC | Holm, 1981 | solvent: Diethyl ether |
C5H11BrMg (solution) + (g) =
(solution) + Br2Mg (solution)
By formula: C5H11BrMg (solution) + HBr (g) = C5H12 (solution) + Br2Mg (solution)
Quantity | Value | Units | Method | Reference | Comment |
---|---|---|---|---|---|
ΔrH° | -306.3 ± 2.2 | kJ/mol | RSC | Holm, 1981 | solvent: Diethyl ether |
C19H15BrMg (solution) + (g) =
(solution) + Br2Mg (solution)
By formula: C19H15BrMg (solution) + HBr (g) = C19H16 (solution) + Br2Mg (solution)
Quantity | Value | Units | Method | Reference | Comment |
---|---|---|---|---|---|
ΔrH° | -231.0 ± 2.2 | kJ/mol | RSC | Holm, 1981 | solvent: Diethyl ether |
C3H7BrMg (solution) + (g) =
(solution) + Br2Mg (solution)
By formula: C3H7BrMg (solution) + HBr (g) = C3H8 (solution) + Br2Mg (solution)
Quantity | Value | Units | Method | Reference | Comment |
---|---|---|---|---|---|
ΔrH° | -305.9 ± 2.2 | kJ/mol | RSC | Holm, 1981 | solvent: Diethyl ether |
(g) + C2H5BrMg (solution) =
(solution) + Br2Mg (solution)
By formula: HBr (g) + C2H5BrMg (solution) = C2H6 (solution) + Br2Mg (solution)
Quantity | Value | Units | Method | Reference | Comment |
---|---|---|---|---|---|
ΔrH° | -299.2 ± 2.2 | kJ/mol | RSC | Holm, 1981 | solvent: Diethyl ether |
C10H22Mg (cr) + (g) +
(l) = 2
(l) + Br2Mg (cr)
By formula: C10H22Mg (cr) + H2 (g) + Br2 (l) = 2C5H12 (l) + Br2Mg (cr)
Quantity | Value | Units | Method | Reference | Comment |
---|---|---|---|---|---|
ΔrH° | -669.6 ± 6.6 | kJ/mol | RSC | Akkerman, Schat, et al., 1983 |

Gas phase ion energetics data

Data compiled as indicated in comments:
LLK - Sharon G. Lias, Rhoda D. Levin, and Sherif A. Kafafi
RDSH - Henry M. Rosenstock, Keith Draxl, Bruce W. Steiner, and John T. Herron
Ionization energy determinations
IE (eV) | Method | Reference | Comment |
---|---|---|---|
10.47 | PE | Lee and Potts, 1979 | LLK |
10.65 ± 0.15 | EI | Berkowitz and Marquart, 1962 | RDSH |
10.85 ± 0.03 | PE | Lee and Potts, 1979 | Vertical value; LLK |
Appearance energy determinations
Ion | AE (eV) | Other Products | Method | Reference | Comment |
---|---|---|---|---|---|
Br+ | 16. ± 1. | ? | EI | Berkowitz and Marquart, 1962 | RDSH |
MgBr+ | 12.0 ± 0.4 | Br | EI | Berkowitz and Marquart, 1962 | RDSH |
Br2+ | 17. ± 1. | Mg | EI | Berkowitz and Marquart, 1962 | RDSH |
Mg+ | 16. ± 1. | ? | EI | Berkowitz and Marquart, 1962 | RDSH |

Gas phase thermochemistry data

Quantity | Value | Units | Method | Reference | Comment |
---|---|---|---|---|---|
ΔfH°gas | -302.92 | kJ/mol | Review | Chase, 1998 | Data last reviewed in June, 1974 |
Quantity | Value | Units | Method | Reference | Comment |
S°gas,1 bar | 301.03 | J/mol*K | Review | Chase, 1998 | Data last reviewed in June, 1974 |
Gas Phase Heat Capacity (Shomate Equation)
Cp° = A + B*t + C*t2 + D*t3 +
E/t2
H° − H°298.15= A*t + B*t2/2 +
C*t3/3 + D*t4/4 − E/t + F − H
S° = A*ln(t) + B*t + C*t2/2 + D*t3/3 −
E/(2*t2) + G
Cp = heat capacity (J/mol*K)
H° = standard enthalpy (kJ/mol)
S° = standard entropy (J/mol*K)
t = temperature (K) / 1000.
View plot Requires a JavaScript / HTML 5 canvas capable browser.
Temperature (K) | 2000. to 6000. |
---|---|
A | 62.01316 |
B | 0.294116 |
C | -0.079647 |
D | 0.006794 |
E | -0.305897 |
F | -322.4500 |
G | 374.2663 |
H | -302.9224 |
Reference | Chase, 1998 |
Comment | Data last reviewed in June, 1974 |

References

Chase, 1998
Chase, M.W., Jr.,
NIST-JANAF Themochemical Tables, Fourth Edition,
J. Phys. Chem. Ref. Data, Monograph 9, 1998, 1-1951. [all data]
Holm, 1981
Holm, T.,
J. Chem. Soc., Perkin Trans. II, 1981, 464.. [all data]
Pedley, 1994
Pedley, J.B.,
Thermodynamic Data and Structures of Organic Compounds; Thermodynamics Research Center Data Series, Vol I, Thermodynamics Research Center, College Station, 1994. [all data]
Akkerman, Schat, et al., 1983
Akkerman, O.S.; Schat, G.; Evers, E.A.I.M.; Bickelhaupt, F.,
Recl. Trav. Chim. Pays-Bas, 1983, 102, 109. [all data]
Lee and Potts, 1979
Lee, E.P.F.; Potts, A.W.,
An investigation of the valence shell electronic structure of alkaline earth halides by using Ab initio S. C. F. calculations and photoelectron spectroscopy,
Proc. R. Soc. London A:, 1979, 365, 395. [all data]
Berkowitz and Marquart, 1962
Berkowitz, J.; Marquart, J.R.,
Mass-spectrometric study of the magnesium halides,
J. Chem. Phys., 1962, 37, 1853. [all data]