Mercury(II) bromide
- Formula: Br2Hg
- Molecular weight: 360.40
- IUPAC Standard InChIKey: NGYIMTKLQULBOO-UHFFFAOYSA-L
- CAS Registry Number: 7789-47-1
- Chemical structure:
View 3d structure (requires JavaScript / HTML 5) - Other names: HgBr2; Mercury(2)bromide; Mercuric bromide; Mercury bromide; Mercury bromide (HgBr2); Mercury(ii) bromide (1:2); UN 1634; Mercury dibromide

Gas phase thermochemistry data

Quantity | Value | Units | Method | Reference | Comment |
---|---|---|---|---|---|
ΔfH°gas | -85.45 | kJ/mol | Review | Chase, 1998 | Data last reviewed in March, 1962 |
Quantity | Value | Units | Method | Reference | Comment |
S°gas,1 bar | 320.22 | J/mol*K | Review | Chase, 1998 | Data last reviewed in March, 1962 |
Gas Phase Heat Capacity (Shomate Equation)
Cp° = A + B*t + C*t2 + D*t3 +
E/t2
H° − H°298.15= A*t + B*t2/2 +
C*t3/3 + D*t4/4 − E/t + F − H
S° = A*ln(t) + B*t + C*t2/2 + D*t3/3 −
E/(2*t2) + G
Cp = heat capacity (J/mol*K)
H° = standard enthalpy (kJ/mol)
S° = standard entropy (J/mol*K)
t = temperature (K) / 1000.
View plot Requires a JavaScript / HTML 5 canvas capable browser.
Temperature (K) | 1500. to 6000. |
---|---|
A | 62.28888 |
B | 0.059456 |
C | -0.016109 |
D | 0.001373 |
E | -0.181466 |
F | -104.6364 |
G | 394.5625 |
H | -85.45402 |
Reference | Chase, 1998 |
Comment | Data last reviewed in March, 1962 |

Condensed phase thermochemistry data

Quantity | Value | Units | Method | Reference | Comment |
---|---|---|---|---|---|
ΔfH°liquid | -156.63 | kJ/mol | Review | Chase, 1998 | Data last reviewed in March, 1962 |
Quantity | Value | Units | Method | Reference | Comment |
S°liquid,1 bar | 192.17 | J/mol*K | Review | Chase, 1998 | Data last reviewed in March, 1962 |
Quantity | Value | Units | Method | Reference | Comment |
ΔfH°solid | -169.45 | kJ/mol | Review | Chase, 1998 | Data last reviewed in March, 1962 |
Quantity | Value | Units | Method | Reference | Comment |
S°solid | 170.33 | J/mol*K | Review | Chase, 1998 | Data last reviewed in March, 1962 |
Liquid Phase Heat Capacity (Shomate Equation)
Cp° = A + B*t + C*t2 + D*t3 +
E/t2
H° − H°298.15= A*t + B*t2/2 +
C*t3/3 + D*t4/4 − E/t + F − H
S° = A*ln(t) + B*t + C*t2/2 + D*t3/3 −
E/(2*t2) + G
Cp = heat capacity (J/mol*K)
H° = standard enthalpy (kJ/mol)
S° = standard entropy (J/mol*K)
t = temperature (K) / 1000.
View plot Requires a JavaScript / HTML 5 canvas capable browser.
Temperature (K) | 514. to 1500. |
---|---|
A | 102.0900 |
B | 3.372760×10-9 |
C | -3.268082×10-9 |
D | 1.031243×10-9 |
E | 3.933852×10-11 |
F | -187.0645 |
G | 315.7175 |
H | -156.6264 |
Reference | Chase, 1998 |
Comment | Data last reviewed in March, 1962 |
Solid Phase Heat Capacity (Shomate Equation)
Cp° = A + B*t + C*t2 + D*t3 +
E/t2
H° − H°298.15= A*t + B*t2/2 +
C*t3/3 + D*t4/4 − E/t + F − H
S° = A*ln(t) + B*t + C*t2/2 + D*t3/3 −
E/(2*t2) + G
Cp = heat capacity (J/mol*K)
H° = standard enthalpy (kJ/mol)
S° = standard entropy (J/mol*K)
t = temperature (K) / 1000.
View plot Requires a JavaScript / HTML 5 canvas capable browser.
Temperature (K) | 298. to 514. |
---|---|
A | 66.69254 |
B | 28.97529 |
C | 0.301358 |
D | -0.094184 |
E | -0.003732 |
F | -190.6327 |
G | 242.3666 |
H | -169.4520 |
Reference | Chase, 1998 |
Comment | Data last reviewed in March, 1962 |

Reaction thermochemistry data

Data compiled as indicated in comments:
MS - José A. Martinho Simões
ALS - Hussein Y. Afeefy, Joel F. Liebman, and Stephen E. Stein
Individual Reactions
By formula: C2H6Hg (l) + 2Br2 (l) = 2CH3Br (g) + Br2Hg (cr)
Quantity | Value | Units | Method | Reference | Comment |
---|---|---|---|---|---|
ΔrH° | -302.1 ± 2.5 | kJ/mol | RSC | Hartley, Pritchard, et al., 1950 | Please also see Pedley and Rylance, 1977 and Cox and Pilcher, 1970.; MS |
C6H14Hg (l) + (cr) = 2C3H7BrHg (cr)
By formula: C6H14Hg (l) + Br2Hg (cr) = 2C3H7BrHg (cr)
Quantity | Value | Units | Method | Reference | Comment |
---|---|---|---|---|---|
ΔrH° | -88.8 ± 1.5 | kJ/mol | RSC | Mortimer, Pritchard, et al., 1952 | Please also see Pedley and Rylance, 1977 and Cox and Pilcher, 1970.; MS |
By formula: C2H6Hg (l) + Br2Hg (cr) = 2CH3BrHg (cr)
Quantity | Value | Units | Method | Reference | Comment |
---|---|---|---|---|---|
ΔrH° | -61.0 ± 3.1 | kJ/mol | RSC | Hartley, Pritchard, et al., 1950 | Please also see Pedley and Rylance, 1977 and Cox and Pilcher, 1970.; MS |
C6H14Hg (l) + (cr) = 2C3H7BrHg (cr)
By formula: C6H14Hg (l) + Br2Hg (cr) = 2C3H7BrHg (cr)
Quantity | Value | Units | Method | Reference | Comment |
---|---|---|---|---|---|
ΔrH° | -75.9 ± 1.3 | kJ/mol | RSC | Mortimer, Pritchard, et al., 1952 | Please also see Pedley and Rylance, 1977 and Cox and Pilcher, 1970.; MS |
(l) +
(cr) = 2C6H5BrHg (cr)
By formula: C12H10Hg (l) + Br2Hg (cr) = 2C6H5BrHg (cr)
Quantity | Value | Units | Method | Reference | Comment |
---|---|---|---|---|---|
ΔrH° | -35.5 ± 1.2 | kJ/mol | RSC | Hartley, Pritchard, et al., 1951 | Please also see Pedley and Rylance, 1977 and Cox and Pilcher, 1970.; MS |
(l) +
(cr) = 2C2H5BrHg (cr)
By formula: C4H10Hg (l) + Br2Hg (cr) = 2C2H5BrHg (cr)
Quantity | Value | Units | Method | Reference | Comment |
---|---|---|---|---|---|
ΔrH° | -74.5 ± 4.6 | kJ/mol | RSC | Hartley, Pritchard, et al., 1951 | Please also see Pedley and Rylance, 1977 and Cox and Pilcher, 1970.; MS |
By formula: 2C6H5Br + Br2Hg = C12H10Hg + 2Br2
Quantity | Value | Units | Method | Reference | Comment |
---|---|---|---|---|---|
ΔrH° | 328.6 ± 3.3 | kJ/mol | Cm | Chernick, Skinner, et al., 1956 | liquid phase; ALS |

Gas phase ion energetics data

Data compiled as indicated in comments:
LBLHLM - Sharon G. Lias, John E. Bartmess, Joel F. Liebman, John L. Holmes, Rhoda D. Levin, and W. Gary Mallard
RDSH - Henry M. Rosenstock, Keith Draxl, Bruce W. Steiner, and John T. Herron
Ionization energy determinations
IE (eV) | Method | Reference | Comment |
---|---|---|---|
10.560 ± 0.003 | PI | Linn, Tzeng, et al., 1983 | LBLHLM |
10.62 | PE | Eland, 1970 | RDSH |
Appearance energy determinations
Ion | AE (eV) | Other Products | Method | Reference | Comment |
---|---|---|---|---|---|
Br+ | 15.08 ± 0.18 | HgBr | PI | Linn, Tzeng, et al., 1983 | LBLHLM |
Br+ | 15.08 ± 0.18 | HgBr | EI | Linn, Tzeng, et al., 1983 | LBLHLM |
Br+ | 16.7 ± 0.2 | ? | EI | Kiser, Dillard, et al., 1969 | RDSH |
BrHg+ | 11.83 ± 0.03 | Br | PI | Linn, Tzeng, et al., 1983 | LBLHLM |
BrHg+ | 11.83 ± 0.03 | Br | EI | Linn, Tzeng, et al., 1983 | LBLHLM |
HgBr+ | 12.09 ± 0.17 | Br | EI | Kiser, Dillard, et al., 1969 | RDSH |
Br2+ | 12.59 ± 0.03 | Hg | PI | Linn, Tzeng, et al., 1983 | LBLHLM |
Br2+ | 12.59 ± 0.03 | Hg | EI | Linn, Tzeng, et al., 1983 | LBLHLM |
Hg+ | 11.85 ± 0.03 | Br2 | EI | Linn, Tzeng, et al., 1983 | LBLHLM |
Hg+ | 11.85 ± 0.03 | Br2 | PI | Linn, Tzeng, et al., 1983 | LBLHLM |

References

Chase, 1998
Chase, M.W., Jr.,
NIST-JANAF Themochemical Tables, Fourth Edition,
J. Phys. Chem. Ref. Data, Monograph 9, 1998, 1-1951. [all data]
Hartley, Pritchard, et al., 1950
Hartley, K.; Pritchard, H.O.; Skinner, H.A.,
Thermochemistry of metallic alkyls. III.?mercury dimethyl and mercury methyl halides,
Trans. Faraday Soc., 1950, 46, 1019, https://doi.org/10.1039/tf9504601019
. [all data]
Pedley and Rylance, 1977
Pedley, J.B.; Rylance, J.,
Computer Analysed Thermochemical Data: Organic and Organometallic Compounds, University of Sussex, Brigton, 1977. [all data]
Cox and Pilcher, 1970
Cox, J.D.; Pilcher, G.,
Thermochemistry of Organic and Organometallic Compounds
in Academic Press, New York, 1970. [all data]
Mortimer, Pritchard, et al., 1952
Mortimer, C.T.; Pritchard, H.O.; Skinner, H.A.,
Thermochemistry of metallic alkyls. Part V.?Mercury di-propyl and mercury di-isopropyl,
Trans. Faraday Soc., 1952, 48, 220, https://doi.org/10.1039/tf9524800220
. [all data]
Hartley, Pritchard, et al., 1951
Hartley, K.; Pritchard, H.O.; Skinner, H.A.,
Thermochemistry of metallic alkyls. IV. Mercury diethyl and mercury diphenyl,
Trans. Faraday Soc., 1951, 47, 254, https://doi.org/10.1039/tf9514700254
. [all data]
Chernick, Skinner, et al., 1956
Chernick, C.L.; Skinner, H.A.; Wadso, I.,
Thermochemistry of metallic alkyls. Part 7.-The heat of formation of mercury diphenyl, and of mercury phenyl chloride,
Trans. Faraday Soc., 1956, 52, 1088-1093. [all data]
Linn, Tzeng, et al., 1983
Linn, S.H.; Tzeng, W.-B.; Brom, J.M., Jr.; Ng, C.Y.,
Molecular beam photoionization study of HgBr2 and HgI2,
J. Chem. Phys., 1983, 78, 50. [all data]
Eland, 1970
Eland, J.H.D.,
Photoelectron spectra and chemical bonding of mercury(II) compounds,
Intern. J. Mass Spectrom. Ion Phys., 1970, 4, 37. [all data]
Kiser, Dillard, et al., 1969
Kiser, R.W.; Dillard, J.G.; Dugger, D.L.,
Mass spectrometry of inorganic halides,
Advan. Chem. Ser., 1969, 72, 153. [all data]