iron dibromide
- Formula: Br2Fe
- Molecular weight: 215.653
- CAS Registry Number: 7789-46-0

Gas phase thermochemistry data

Quantity | Value | Units | Method | Reference | Comment |
---|---|---|---|---|---|
ΔfH°gas | -41.42 | kJ/mol | Review | Chase, 1998 | Data last reviewed in September, 1966 |
Quantity | Value | Units | Method | Reference | Comment |
S°gas,1 bar | 337.36 | J/mol*K | Review | Chase, 1998 | Data last reviewed in September, 1966 |
Gas Phase Heat Capacity (Shomate Equation)
Cp° = A + B*t + C*t2 + D*t3 +
E/t2
H° − H°298.15= A*t + B*t2/2 +
C*t3/3 + D*t4/4 − E/t + F − H
S° = A*ln(t) + B*t + C*t2/2 + D*t3/3 −
E/(2*t2) + G
Cp = heat capacity (J/mol*K)
H° = standard enthalpy (kJ/mol)
S° = standard entropy (J/mol*K)
t = temperature (K) / 1000.
View plot Requires a JavaScript / HTML 5 canvas capable browser.
Temperature (K) | 2000. to 6000. |
---|---|
A | 57.84254 |
B | 7.661573 |
C | -1.935800 |
D | 0.143845 |
E | -1.735758 |
F | -60.66172 |
G | 404.5823 |
H | -41.42206 |
Reference | Chase, 1998 |
Comment | Data last reviewed in September, 1966 |

Condensed phase thermochemistry data

Quantity | Value | Units | Method | Reference | Comment |
---|---|---|---|---|---|
ΔfH°liquid | -211.01 | kJ/mol | Review | Chase, 1998 | Data last reviewed in September, 1966 |
Quantity | Value | Units | Method | Reference | Comment |
S°liquid,1 bar | 169.38 | J/mol*K | Review | Chase, 1998 | Data last reviewed in September, 1966 |
Quantity | Value | Units | Method | Reference | Comment |
ΔfH°solid | -248.95 | kJ/mol | Review | Chase, 1998 | Data last reviewed in September, 1966 |
Quantity | Value | Units | Method | Reference | Comment |
S°solid | 140.67 | J/mol*K | Review | Chase, 1998 | Data last reviewed in September, 1966 |
Liquid Phase Heat Capacity (Shomate Equation)
Cp° = A + B*t + C*t2 + D*t3 +
E/t2
H° − H°298.15= A*t + B*t2/2 +
C*t3/3 + D*t4/4 − E/t + F − H
S° = A*ln(t) + B*t + C*t2/2 + D*t3/3 −
E/(2*t2) + G
Cp = heat capacity (J/mol*K)
H° = standard enthalpy (kJ/mol)
S° = standard entropy (J/mol*K)
t = temperature (K) / 1000.
View plot Requires a JavaScript / HTML 5 canvas capable browser.
Temperature (K) | 964. to 2000. |
---|---|
A | 106.6920 |
B | 6.840883×10-9 |
C | -5.250168×10-9 |
D | 1.286200×10-9 |
E | 1.205829×10-10 |
F | -242.8155 |
G | 298.4903 |
H | -211.0054 |
Reference | Chase, 1998 |
Comment | Data last reviewed in September, 1966 |
Solid Phase Heat Capacity (Shomate Equation)
Cp° = A + B*t + C*t2 + D*t3 +
E/t2
H° − H°298.15= A*t + B*t2/2 +
C*t3/3 + D*t4/4 − E/t + F − H
S° = A*ln(t) + B*t + C*t2/2 + D*t3/3 −
E/(2*t2) + G
Cp = heat capacity (J/mol*K)
H° = standard enthalpy (kJ/mol)
S° = standard entropy (J/mol*K)
t = temperature (K) / 1000.
View plot Requires a JavaScript / HTML 5 canvas capable browser.
Temperature (K) | 298. to 650. | 650. to 964. |
---|---|---|
A | 74.16220 | 69.20970 |
B | 19.59150 | 32.36990 |
C | 4.612490 | -8.572280 |
D | -2.775301 | 2.533470 |
E | -0.009540 | 0.313303 |
F | -271.9980 | -269.5980 |
G | 224.3380 | 217.1770 |
H | -248.9480 | -248.9480 |
Reference | Chase, 1998 | Chase, 1998 |
Comment | Data last reviewed in September, 1966 | Data last reviewed in September, 1966 |

Gas phase ion energetics data

Data compiled as indicated in comments:
LLK - Sharon G. Lias, Rhoda D. Levin, and Sherif A. Kafafi
RDSH - Henry M. Rosenstock, Keith Draxl, Bruce W. Steiner, and John T. Herron
Ionization energy determinations
IE (eV) | Method | Reference | Comment |
---|---|---|---|
10.7 ± 0.5 | EI | Porter and Schoonmaker, 1959 | RDSH |
9.7 | PE | MacNaughton, Bloor, et al., 1981 | Vertical value; LLK |
Appearance energy determinations
Ion | AE (eV) | Other Products | Method | Reference | Comment |
---|---|---|---|---|---|
FeBr+ | 12.9 ± 0.5 | Br | EI | Porter and Schoonmaker, 1959 | RDSH |
Fe+ | 16.6 ± 0.5 | ? | EI | Porter and Schoonmaker, 1959 | RDSH |

References

Chase, 1998
Chase, M.W., Jr.,
NIST-JANAF Themochemical Tables, Fourth Edition,
J. Phys. Chem. Ref. Data, Monograph 9, 1998, 1-1951. [all data]
Porter and Schoonmaker, 1959
Porter, R.F.; Schoonmaker, R.C.,
A mass spectrometric study of the vaporization of ferrous bromide,
J. Phys. Chem., 1959, 63, 626. [all data]
MacNaughton, Bloor, et al., 1981
MacNaughton, R.M.; Bloor, J.E.; Sherrod, R.E.; Schweitzer, G.K.,
The He(I) photoelectron psectra of some gaseous 3d-transition metal dihalides,
J. Electron Spectrosc. Relat. Phenom., 1981, 22, 1. [all data]