rubidium bromide
- Formula: BrRb
- Molecular weight: 165.372
- IUPAC Standard InChIKey: JAAGVIUFBAHDMA-UHFFFAOYSA-M
- CAS Registry Number: 7789-39-1
- Chemical structure:
View 3d structure (requires JavaScript / HTML 5) - Permanent link for this species. Use this link for bookmarking this species for future reference.

Phase change data

Antoine Equation Parameters
log10(P) = A − (B / (T + C))
P = vapor pressure (bar)
T = temperature (K)
View plot Requires a JavaScript / HTML 5 canvas capable browser.
Temperature (K) | A | B | C | Reference | Comment |
---|---|---|---|---|---|
1054. to 1625. | 4.72032 | 7083.026 | -121.975 | Stull, 1947 | Coefficents calculated by NIST from author's data. |

Gas phase ion energetics data

Data evaluated as indicated in comments:
L - Sharon G. Lias
Data compiled as indicated in comments:
LLK - Sharon G. Lias, Rhoda D. Levin, and Sherif A. Kafafi
Quantity | Value | Units | Method | Reference | Comment |
---|---|---|---|---|---|
IE (evaluated) | 7.94 ± 0.03 | eV | N/A | N/A | L |
Ionization energy determinations
IE (eV) | Method | Reference | Comment |
---|---|---|---|
7.8 ± 0.1 | PE | Potts and Price, 1977 | LLK |
7.8 ± 0.1 | PE | Potts, Williams, et al., 1974 | LLK |
7.94 ± 0.03 | PI | Berkowitz, 1971 | LLK |
8.62 ± 0.04 | PE | Potts and Price, 1977 | Vertical value; LLK |
8.0 | PE | Goodman, Allen, et al., 1974 | Vertical value; LLK |
Appearance energy determinations
Ion | AE (eV) | Other Products | Method | Reference | Comment |
---|---|---|---|---|---|
Rb+ | 21.10 ± 0.04 | Br(-) | PE | Potts and Price, 1977 | LLK |
Rb+ | 8.12 ± 0.03 | Br | PI | Berkowitz, 1971 | LLK |

Constants of diatomic molecules

Data compiled by: Klaus P. Huber and Gerhard H. Herzberg
Data collected through July, 1977
Symbol | Meaning |
---|---|
State | electronic state and / or symmetry symbol |
Te | minimum electronic energy (cm-1) |
ωe | vibrational constant – first term (cm-1) |
ωexe | vibrational constant – second term (cm-1) |
ωeye | vibrational constant – third term (cm-1) |
Be | rotational constant in equilibrium position (cm-1) |
αe | rotational constant – first term (cm-1) |
γe | rotation-vibration interaction constant (cm-1) |
De | centrifugal distortion constant (cm-1) |
βe | rotational constant – first term, centrifugal force (cm-1) |
re | internuclear distance (Å) |
Trans. | observed transition(s) corresponding to electronic state |
ν00 | position of 0-0 band (units noted in table) |
State | Te | ωe | ωexe | ωeye | Be | αe | γe | De | βe | re | Trans. | ν00 |
---|---|---|---|---|---|---|---|---|---|---|---|---|
Absorption continua with maxima at 35700, 38800, 46700 cm-1. 1 | ||||||||||||
↳Muller, 1927; Barrow and Caunt, 1953; Davidovits and Brodhead, 1967 | ||||||||||||
A 3 | A ↔ X 2 | |||||||||||
↳Barrow and Caunt, 1953; Oldenborg, Gole, et al., 1974 | ||||||||||||
X 1Σ+ | 0 | 169.46 4 | 0.463 4 | 0.04752798 | 0.00018596 5 | 0.000000214 | 1.4959E-8 | 2.944744 6 | ||||
↳Honig, Mandel, et al., 1954; Rusk and Gordy, 1962; Tiemann, Holzer, et al., 1977 |

References

Stull, 1947
Stull, Daniel R.,
Vapor Pressure of Pure Substances. Organic and Inorganic Compounds,
Ind. Eng. Chem., 1947, 39, 4, 517-540, https://doi.org/10.1021/ie50448a022
. [all data]
Potts and Price, 1977
Potts, A.W.; Price, W.C.,
Photoelectron studies of ionic materials using molecular beam techniques,
Phys. Scr., 1977, 16, 191. [all data]
Potts, Williams, et al., 1974
Potts, A.W.; Williams, T.A.; Price, W.C.,
Photoelectron spectra and electronic structure of diatomic alkali halides,
Proc. Roy. Soc. London A, 1974, 341, 147. [all data]
Berkowitz, 1971
Berkowitz, J.,
Photoionization mass spectrometry photoelectron spectroscopy of high temperature vapor,
Adv. High Temp. Chem., 1971, 3, 123. [all data]
Goodman, Allen, et al., 1974
Goodman, T.D.; Allen, J.D., Jr.; Cusachs, L.C.; Schweitzer, G.K.,
The photoelectron spectra of gaseous alkali halides,
J. Electron Spectrosc. Relat. Phenom., 1974, 3, 289. [all data]
Muller, 1927
Muller, L.A.,
4. absorptionsspektren der alkalihalogenide in wasseriger losung und im dampf,
Ann. Phys. (Leipzig), 1927, 82, 39. [all data]
Barrow and Caunt, 1953
Barrow, R.F.; Caunt, A.D.,
The ultra-violet absorption spectra of some gaseous alkali-metal halides and the dissociation energy of fluorine,
Proc. R. Soc. London A, 1953, 219, 120. [all data]
Davidovits and Brodhead, 1967
Davidovits, P.; Brodhead, D.C.,
Ultraviolet absorption cross sections for the alkali halide vapors,
J. Chem. Phys., 1967, 46, 2968. [all data]
Oldenborg, Gole, et al., 1974
Oldenborg, R.C.; Gole, J.L.; Zare, R.N.,
Chemiluminescent spectra of alkali-halogen reactions,
J. Chem. Phys., 1974, 60, 4032. [all data]
Honig, Mandel, et al., 1954
Honig, A.; Mandel, M.; Stitch, M.L.; Townes, C.H.,
Microwave spectra of the alkali halides,
Phys. Rev., 1954, 96, 629. [all data]
Rusk and Gordy, 1962
Rusk, J.R.; Gordy, W.,
Millimeter wave molecular beam spectroscopy: alkali bromides and iodides,
Phys. Rev., 1962, 127, 817. [all data]
Tiemann, Holzer, et al., 1977
Tiemann, E.; Holzer, B.; Hoeft, J.,
Hyperfeinstruktur des RbBr,
Z. Naturforsch. A, 1977, 32, 123. [all data]
Geiger and Pfeiffer, 1968
Geiger, J.; Pfeiffer, H.-C.,
Untersuchung der Anregung innerer Elektronen von Alkalihalogenidmolekulen im Energieverlustspektrum von 25 keV-Elektronen,
Z. Phys., 1968, 208, 105. [all data]
Brewer and Brackett, 1961
Brewer, L.; Brackett, E.,
The dissociation energies of gaseous alkali halides,
Chem. Rev., 1961, 61, 425. [all data]
Bulewicz, Phillips, et al., 1961
Bulewicz, E.M.; Phillips, L.F.; Sugden, T.M.,
Determination of dissociation constants and heats of formation of simple molecules by flame photometry. Part 8. Stabilities of the gaseous diatomic halides of certain metals,
Trans. Faraday Soc., 1961, 57, 921. [all data]
Story and Hebert, 1976
Story, T.L., Jr.; Hebert, A.J.,
Dipole moments of KI, RbBr, RbI, CsBr, and CsI by the electric deflection method,
J. Chem. Phys., 1976, 64, 855. [all data]