bromine pentafluoride
- Formula: BrF5
- Molecular weight: 174.896
- IUPAC Standard InChIKey: XHVUVQAANZKEKF-UHFFFAOYSA-N
- CAS Registry Number: 7789-30-2
- Chemical structure:
View 3d structure (requires JavaScript / HTML 5) - Permanent link for this species. Use this link for bookmarking this species for future reference.

Gas phase thermochemistry data

Quantity | Value | Units | Method | Reference | Comment |
---|---|---|---|---|---|
ΔfH°gas | -428.72 | kJ/mol | Review | Chase, 1998 | Data last reviewed in September, 1965 |
Quantity | Value | Units | Method | Reference | Comment |
S°gas,1 bar | 323.53 | J/mol*K | Review | Chase, 1998 | Data last reviewed in September, 1965 |
Gas Phase Heat Capacity (Shomate Equation)
Cp° = A + B*t + C*t2 + D*t3 +
E/t2
H° − H°298.15= A*t + B*t2/2 +
C*t3/3 + D*t4/4 − E/t + F − H
S° = A*ln(t) + B*t + C*t2/2 + D*t3/3 −
E/(2*t2) + G
Cp = heat capacity (J/mol*K)
H° = standard enthalpy (kJ/mol)
S° = standard entropy (J/mol*K)
t = temperature (K) / 1000.
View plot Requires a JavaScript / HTML 5 canvas capable browser.
Temperature (K) | 298. to 6000. |
---|---|
A | 128.5936 |
B | 3.764801 |
C | -1.016830 |
D | 0.086595 |
E | -2.571877 |
F | -475.8421 |
G | 463.5998 |
H | -428.7177 |
Reference | Chase, 1998 |
Comment | Data last reviewed in September, 1965 |

Phase change data

Data compiled as indicated in comments:
BS - Robert L. Brown and Stephen E. Stein
TRC - Thermodynamics Research Center, NIST Boulder Laboratories, Chris Muzny director
AC - William E. Acree, Jr., James S. Chickos
Quantity | Value | Units | Method | Reference | Comment |
---|---|---|---|---|---|
Tboil | 313.4 | K | N/A | PCR Inc., 1990 | BS |
Tboil | 314.45 | K | N/A | Stein, Vogel, et al., 1954 | Uncertainty assigned by TRC = 0.5 K; TRC |
Quantity | Value | Units | Method | Reference | Comment |
Tfus | 211.85 | K | N/A | Stein, Vogel, et al., 1954 | Uncertainty assigned by TRC = 0.6 K; TRC |
Enthalpy of vaporization
ΔvapH (kJ/mol) | Temperature (K) | Reference | Comment |
---|---|---|---|
30.6 | 304. | Rogers and Speirs, 1956 | Based on data from 297. to 314. K.; AC |
31.2 | 255. | Ruff and Menzel, 1931 | Based on data from 213. to 297. K.; AC |
Antoine Equation Parameters
log10(P) = A − (B / (T + C))
P = vapor pressure (bar)
T = temperature (K)
View plot Requires a JavaScript / HTML 5 canvas capable browser.
Temperature (K) | A | B | C | Reference | Comment |
---|---|---|---|---|---|
203.8 to 313.6 | 4.79777 | 1411.692 | -19.763 | Stull, 1947 | Coefficents calculated by NIST from author's data. |

Gas phase ion energetics data

Data compiled as indicated in comments:
LLK - Sharon G. Lias, Rhoda D. Levin, and Sherif A. Kafafi
RDSH - Henry M. Rosenstock, Keith Draxl, Bruce W. Steiner, and John T. Herron
Ionization energy determinations
IE (eV) | Method | Reference | Comment |
---|---|---|---|
13.172 ± 0.005 | PE | DeKock, Higginson, et al., 1972 | LLK |
Appearance energy determinations
Ion | AE (eV) | Other Products | Method | Reference | Comment |
---|---|---|---|---|---|
BrF+ | ~20. | ? | EI | Irsa and Friedman, 1958 | RDSH |
BrF2+ | 16.1 ± 0.2 | ? | EI | Irsa and Friedman, 1958 | RDSH |
BrF3+ | 15.5 ± 0.2 | ? | EI | Irsa and Friedman, 1958 | RDSH |
BrF4+ | 14.0 ± 0.3 | F-? | EI | Irsa and Friedman, 1958 | RDSH |

References

Chase, 1998
Chase, M.W., Jr.,
NIST-JANAF Themochemical Tables, Fourth Edition,
J. Phys. Chem. Ref. Data, Monograph 9, 1998, 1-1951. [all data]
PCR Inc., 1990
PCR Inc.,
Research Chemicals Catalog 1990-1991, PCR Inc., Gainesville, FL, 1990, 1. [all data]
Stein, Vogel, et al., 1954
Stein, L.; Vogel, R.C.; Ludewig, W.H.,
Partial Molal Volumes and Molar Refractions of the System Bromine Trifluoride-Bromine Pentafluoride,
J. Am. Chem. Soc., 1954, 76, 4287-9. [all data]
Rogers and Speirs, 1956
Rogers, Max T.; Speirs, John L.,
Bromine Pentafluoride. Freezing and Boiling Points, Heat of Vaporization and Vapor Pressure- Temperature Relations,
J. Phys. Chem., 1956, 60, 10, 1462-1463, https://doi.org/10.1021/j150544a038
. [all data]
Ruff and Menzel, 1931
Ruff, Otto; Menzel, Walter,
Das Brom-5-fluorid,
Z. Anorg. Allg. Chem., 1931, 202, 1, 49-61, https://doi.org/10.1002/zaac.19312020106
. [all data]
Stull, 1947
Stull, Daniel R.,
Vapor Pressure of Pure Substances. Organic and Inorganic Compounds,
Ind. Eng. Chem., 1947, 39, 4, 517-540, https://doi.org/10.1021/ie50448a022
. [all data]
DeKock, Higginson, et al., 1972
DeKock, R.L.; Higginson, B.R.; Lloyd, D.R.,
Photoelectron spectra of halides. Part 6.--The spectra of SF5Cl, BrF5 and IF5,
Faraday Discuss. Chem. Soc., 1972, 54, 84. [all data]
Irsa and Friedman, 1958
Irsa, A.P.; Friedman, L.,
Mass spectra of halogen fluorides,
J. Inorg. Nucl. Chem., 1958, 6, 77. [all data]