iron difluoride
- Formula: F2Fe
- Molecular weight: 93.842
- CAS Registry Number: 7789-28-8

Gas phase thermochemistry data

Quantity | Value | Units | Method | Reference | Comment |
---|---|---|---|---|---|
ΔfH°gas | -389.53 | kJ/mol | Review | Chase, 1998 | Data last reviewed in September, 1965 |
Quantity | Value | Units | Method | Reference | Comment |
S°gas,1 bar | 265.19 | J/mol*K | Review | Chase, 1998 | Data last reviewed in September, 1965 |
Gas Phase Heat Capacity (Shomate Equation)
Cp° = A + B*t + C*t2 + D*t3 +
E/t2
H° − H°298.15= A*t + B*t2/2 +
C*t3/3 + D*t4/4 − E/t + F − H
S° = A*ln(t) + B*t + C*t2/2 + D*t3/3 −
E/(2*t2) + G
Cp = heat capacity (J/mol*K)
H° = standard enthalpy (kJ/mol)
S° = standard entropy (J/mol*K)
t = temperature (K) / 1000.
View plot Requires a JavaScript / HTML 5 canvas capable browser.
Temperature (K) | 3000. to 6000. |
---|---|
A | 62.73657 |
B | 2.239336 |
C | -0.646198 |
D | 0.050511 |
E | 1.021960 |
F | -407.1086 |
G | 340.4655 |
H | -389.5304 |
Reference | Chase, 1998 |
Comment | Data last reviewed in September, 1965 |

Condensed phase thermochemistry data

Quantity | Value | Units | Method | Reference | Comment |
---|---|---|---|---|---|
ΔfH°liquid | -674.55 | kJ/mol | Review | Chase, 1998 | Data last reviewed in September, 1965 |
Quantity | Value | Units | Method | Reference | Comment |
S°liquid,1 bar | 92.54 | J/mol*K | Review | Chase, 1998 | Data last reviewed in September, 1965 |
Quantity | Value | Units | Method | Reference | Comment |
ΔfH°solid | -705.84 | kJ/mol | Review | Chase, 1998 | Data last reviewed in September, 1965 |
Quantity | Value | Units | Method | Reference | Comment |
S°solid | 86.95 | J/mol*K | Review | Chase, 1998 | Data last reviewed in September, 1965 |
Liquid Phase Heat Capacity (Shomate Equation)
Cp° = A + B*t + C*t2 + D*t3 +
E/t2
H° − H°298.15= A*t + B*t2/2 +
C*t3/3 + D*t4/4 − E/t + F − H
S° = A*ln(t) + B*t + C*t2/2 + D*t3/3 −
E/(2*t2) + G
Cp = heat capacity (J/mol*K)
H° = standard enthalpy (kJ/mol)
S° = standard entropy (J/mol*K)
t = temperature (K) / 1000.
View plot Requires a JavaScript / HTML 5 canvas capable browser.
Temperature (K) | 1373. to 3000. |
---|---|
A | 98.32400 |
B | 2.199027×10-10 |
C | -1.201491×10-10 |
D | 2.045362×10-11 |
E | 7.122801×10-12 |
F | -703.8660 |
G | 211.5246 |
H | -674.5487 |
Reference | Chase, 1998 |
Comment | Data last reviewed in September, 1965 |
Solid Phase Heat Capacity (Shomate Equation)
Cp° = A + B*t + C*t2 + D*t3 +
E/t2
H° − H°298.15= A*t + B*t2/2 +
C*t3/3 + D*t4/4 − E/t + F − H
S° = A*ln(t) + B*t + C*t2/2 + D*t3/3 −
E/(2*t2) + G
Cp = heat capacity (J/mol*K)
H° = standard enthalpy (kJ/mol)
S° = standard entropy (J/mol*K)
t = temperature (K) / 1000.
View plot Requires a JavaScript / HTML 5 canvas capable browser.
Temperature (K) | 298. to 1373. |
---|---|
A | 61.53451 |
B | 39.87026 |
C | -23.89562 |
D | 4.905782 |
E | -0.297405 |
F | -726.7650 |
G | 148.8768 |
H | -705.8408 |
Reference | Chase, 1998 |
Comment | Data last reviewed in September, 1965 |

Gas phase ion energetics data

Data compiled as indicated in comments:
RDSH - Henry M. Rosenstock, Keith Draxl, Bruce W. Steiner, and John T. Herron
B - John E. Bartmess
Electron affinity determinations
EA (eV) | Method | Reference | Comment |
---|---|---|---|
<2.69291 | TDEq | Borshchevskii, Boltalina, et al., 1988 | B |
Ionization energy determinations
IE (eV) | Method | Reference | Comment |
---|---|---|---|
11.3 ± 0.3 | EI | Kent and Margrave, 1965 | RDSH |
Appearance energy determinations
Ion | AE (eV) | Other Products | Method | Reference | Comment |
---|---|---|---|---|---|
FeF+ | 12.6 ± 0.3 | F | EI | Kent and Margrave, 1965 | RDSH |
Fe+ | 16.5 ± 0.3 | ? | EI | Kent and Margrave, 1965 | RDSH |

Phase change data

Data compiled by: William E. Acree, Jr., James S. Chickos
Quantity | Value | Units | Method | Reference | Comment |
---|---|---|---|---|---|
ΔsubH° | 64.8 ± 0.48 | kcal/mol | N/A | Bardi, Brunetti, et al., 1996 | |
ΔsubH° | 64.5 ± 0.7 | kcal/mol | N/A | Zhuravleva, Alikhanyan, et al., 1976 | See also Bardi, Brunetti, et al., 1996. |
Enthalpy of sublimation
ΔsubH (kcal/mol) | Temperature (K) | Method | Reference | Comment |
---|---|---|---|---|
62.9 ± 0.48 | 1068. | TE,ME | Bardi, Brunetti, et al., 1996 | Based on data from 958. to 1178. K. |
62.9 ± 0.7 | 995. | ME | Zhuravleva, Alikhanyan, et al., 1976 | Based on data from 848. to 1142. K. See also Bardi, Brunetti, et al., 1996. |

Reaction thermochemistry data

Data compiled by: John E. Bartmess
Individual Reactions
(F- • 4294967295F2Fe) + F2Fe = F-
By formula: (F- • 4294967295F2Fe) + F2Fe = F-
Quantity | Value | Units | Method | Reference | Comment |
---|---|---|---|---|---|
ΔrH° | 87.7 ± 3.6 | kcal/mol | TDAs | Boltalina, Borshchevskii, et al., 1992 | gas phase; Critical review; value altered from reference due to conversion from electron convention to ion convention |
ΔrH° | 85.8 ± 2.6 | kcal/mol | TDEq | Borshchevskii, Boltalina, et al., 1988 | gas phase; Fluoride Affinity: FeF2 < FeF3 by 22.6±2.6 kcal/mol.; value altered from reference due to conversion from electron convention to ion convention |
ΔrH° | 89.3 ± 4.1 | kcal/mol | TDEq | Kuznetsov, Korobov, et al., 1986 | gas phase; value altered from reference due to conversion from electron convention to ion convention |
ΔrH° | 85.8 ± 2.1 | kcal/mol | TDEq | Sidirov, Borshchevsky, et al., 1986 | gas phase; Corrections to Sorokin, Sidorov, et al., 1981, better neutral pressure determination; value altered from reference due to conversion from electron convention to ion convention |
ΔrH° | 105.4 ± 3.3 | kcal/mol | TDEq | Sorokin, Sidorov, et al., 1981 | gas phase; Fluoride Affinity: 15.3±1.2 kcal < AlF3; value altered from reference due to conversion from electron convention to ion convention |
By formula: F3Fe- + F2Fe = F5Fe2-
Quantity | Value | Units | Method | Reference | Comment |
---|---|---|---|---|---|
ΔrH° | 48.3 ± 8.8 | kcal/mol | TDEq | Sidirov, Borshchevsky, et al., 1986 | gas phase; value altered from reference due to conversion from electron convention to ion convention |
ΔrH° | 48.1 ± 1.0 | kcal/mol | TDAs | Sorokin, Sidorov, et al., 1981 | gas phase; ΔHf(A-) at 0 K; value altered from reference due to conversion from electron convention to ion convention |

Ion clustering data

Data compiled by: John E. Bartmess
Clustering reactions
(F- • 4294967295F2Fe) + F2Fe = F-
By formula: (F- • 4294967295F2Fe) + F2Fe = F-
Quantity | Value | Units | Method | Reference | Comment |
---|---|---|---|---|---|
ΔrH° | 87.7 ± 3.6 | kcal/mol | TDAs | Boltalina, Borshchevskii, et al., 1992 | gas phase; Critical review; value altered from reference due to conversion from electron convention to ion convention |
ΔrH° | 85.8 ± 2.6 | kcal/mol | TDEq | Borshchevskii, Boltalina, et al., 1988 | gas phase; Fluoride Affinity: FeF2 < FeF3 by 22.6±2.6 kcal/mol.; value altered from reference due to conversion from electron convention to ion convention |
ΔrH° | 89.3 ± 4.1 | kcal/mol | TDEq | Kuznetsov, Korobov, et al., 1986 | gas phase; value altered from reference due to conversion from electron convention to ion convention |
ΔrH° | 85.8 ± 2.1 | kcal/mol | TDEq | Sidirov, Borshchevsky, et al., 1986 | gas phase; Corrections to Sorokin, Sidorov, et al., 1981, better neutral pressure determination; value altered from reference due to conversion from electron convention to ion convention |
ΔrH° | 105.4 ± 3.3 | kcal/mol | TDEq | Sorokin, Sidorov, et al., 1981 | gas phase; Fluoride Affinity: 15.3±1.2 kcal < AlF3; value altered from reference due to conversion from electron convention to ion convention |
By formula: F3Fe- + F2Fe = F5Fe2-
Quantity | Value | Units | Method | Reference | Comment |
---|---|---|---|---|---|
ΔrH° | 48.3 ± 8.8 | kcal/mol | TDEq | Sidirov, Borshchevsky, et al., 1986 | gas phase; value altered from reference due to conversion from electron convention to ion convention |
ΔrH° | 48.1 ± 1.0 | kcal/mol | TDAs | Sorokin, Sidorov, et al., 1981 | gas phase; ΔHf(A-) at 0 K; value altered from reference due to conversion from electron convention to ion convention |

References

Chase, 1998
Chase, M.W., Jr.,
NIST-JANAF Themochemical Tables, Fourth Edition,
J. Phys. Chem. Ref. Data, Monograph 9, 1998, 1-1951. [all data]
Borshchevskii, Boltalina, et al., 1988
Borshchevskii, A.Ya.; Boltalina, O.V.; Sorokin, I.D.; Sidorov, L.N.,
Thermochemical Quantities for Gas Phase Iron, Uranium, and Molybdenum Fluorides, and Their Negative Ions.,
J. Chem. Thermodyn., 1988, 20, 5, 523, https://doi.org/10.1016/0021-9614(88)90080-8
. [all data]
Kent and Margrave, 1965
Kent, R.A.; Margrave, J.L.,
Mass spectrometric studies at high temperatures. VIII. The sublimation pressure of iron(II) fluoride,
J. Am. Chem. Soc., 1965, 87, 4754. [all data]