thallium fluoride
- Formula: FTl
- Molecular weight: 223.3817
- IUPAC Standard InChIKey: CULOEOTWMUCRSJ-UHFFFAOYSA-M
- CAS Registry Number: 7789-27-7
- Chemical structure:
View 3d structure (requires JavaScript / HTML 5) - Other names: Thallium monofluoride

Phase change data

Data compiled by: William E. Acree, Jr., James S. Chickos
Quantity | Value | Units | Method | Reference | Comment |
---|---|---|---|---|---|
ΔsubH° | 142.7 | kJ/mol | N/A | Keneshea and Cubicciotti, 1967 |

Gas phase ion energetics data

Data compiled as indicated in comments:
LLK - Sharon G. Lias, Rhoda D. Levin, and Sherif A. Kafafi
RDSH - Henry M. Rosenstock, Keith Draxl, Bruce W. Steiner, and John T. Herron
Ionization energy determinations
IE (eV) | Method | Reference | Comment |
---|---|---|---|
10.52 | PE | Dehmer, Berkowitz, et al., 1973 | LLK |
11.2 ± 0.5 | EI | Murad, Hildenbrand, et al., 1966 | RDSH |
10.80 ± 0.02 | PE | Streets and Berkowitz, 1976 | Vertical value; LLK |
Appearance energy determinations
Ion | AE (eV) | Other Products | Method | Reference | Comment |
---|---|---|---|---|---|
Tl+ | 10.68 | F | PI | Berkowitz and Walter, 1968 | RDSH |
Tl+ | 7.59 | F- | PI | Berkowitz and Walter, 1968 | RDSH |

Constants of diatomic molecules

Data compiled by: Klaus P. Huber and Gerhard H. Herzberg

Data collected through November, 1977

Symbols used in the table of constants
SymbolMeaning
State electronic state and / or symmetry symbol
Te minimum electronic energy (cm-1)
ωe vibrational constant – first term (cm-1)
ωexe vibrational constant – second term (cm-1)
ωeye vibrational constant – third term (cm-1)
Be rotational constant in equilibrium position (cm-1)
αe rotational constant – first term (cm-1)
γe rotation-vibration interaction constant (cm-1)
De centrifugal distortion constant (cm-1)
βe rotational constant – first term, centrifugal force (cm-1)
re internuclear distance (Å)
Trans. observed transition(s) corresponding to electronic state
ν00 position of 0-0 band (units noted in table)
Diatomic constants for 205Tl19F
StateTeωeωexeωeyeBeαeγeDeβereTrans.ν00
Rao and Rao, 1955 report emission bands in the region 28500 - 29500 cm-1; uncertain.
Absorption continua at ~ 45400 and above 50000 cm-1.
missing citation
C (1Π) (45546) [346] H 1         C ← X R 45481 H
missing citation
Absorption continuum at ~ 38400 cm-1.
Howell, 1937
StateTeωeωexeωeyeBeαeγeDeβereTrans.ν00
B 3Π1 36863.08 366.64 10.22 -1.155 0.22492 0.00307 -9.05E-4 [3.92E-7] 2  2.0762 B ↔ X R 36805.63 Z
missing citation; Barrow, Cheall, et al., 1958
A 3Π0+ 35186.02 436.3 7.1 -0.1 0.23091 0.00274 -1.35E-4 2.81E-7 2.2E-7 2.0491 A ↔ X VR 35164.31 Z
missing citation; Barrow, Cheall, et al., 1958
X 1Σ+ 0 477.3 2.3  0.223150163 0.001503850 3 3.142E-6 1.948E-7  2.084438
Brom and Franzen, 1971; Lesiecki and Nibler, 1975
Rotation sp.
Ritchie and Lew, 1965; Hoeft, Lovas, et al., 1970; Dijkerman, Flegel, et al., 1972; Honerjager and Tischer, 1973; Lovas and Tiemann, 1974
Mol. beam el. reson. 4
Graff, Paul, et al., 1958; Graff, 1959; Drechsler and Graff, 1961; Boeckh, Graff, et al., 1964

References

Keneshea and Cubicciotti, 1967
Keneshea, Francis J.; Cubicciotti, Daniel,
The thermodynamics of vaporization of thallous fluoride,
J. Phys. Chem., 1967, 71, 6, 1958-1960, https://doi.org/10.1021/j100865a076
. [all data]
Dehmer, Berkowitz, et al., 1973
Dehmer, J.L.; Berkowitz, J.; Cusachs, L.C.,
Photoelectron spectroscopy of high-temperature vapors. III. Monomer and dimer spectra of thallous fluoride,
J. Chem. Phys., 1973, 58, 5681. [all data]
Murad, Hildenbrand, et al., 1966
Murad, E.; Hildenbrand, D.L.; Main, R.P.,
Dissociation energies of group IIIA monofluorides-the possibility of potential maxima in their excited H states,,
J. Chem. Phys., 1966, 45, 263. [all data]
Streets and Berkowitz, 1976
Streets, D.G.; Berkowitz, J.,
The structure of Tl2F2 from photoelectron spectroscopy,
Chem. Phys. Lett., 1976, 38, 475. [all data]
Berkowitz and Walter, 1968
Berkowitz, J.; Walter, T.A.,
Photoionization of high-temperature vapors. IV.TIF, TICI, and TIBr,
J. Chem. Phys., 1968, 49, 1184. [all data]